{"text_format":"1","workbook":"xlsx","n_sheets":20,"sheets":["ElencoEmergenze","RI_2","RI_3","RI_4","AIB_2","AIB_3","RS_2","RS_3","IR_3","RG_2","RG_3","MR_3","IN","IV_3","POS","IRD_3","RIL_2","RIL_3","RIL_4","GE"],"not_rendered":{"charts":0,"images":13,"macros":1,"external_links":1,"defined_names":249,"comments":0,"pivot_tables":0},"unopened":[],"bounds":{"document_bytes":16777216,"sheet_cells":100000,"rows_first":2000,"rows_last":500,"rows_between":2000,"halvings":0,"cell_chars":16384,"cell_head_chars":4096},"cells_cut":0,"cells_raw":0,"read":"whole","date_system":"1900"}

{"sheet":"ElencoEmergenze","index":0,"n_rows":172,"n_cols":21,"rows_kept":172,"cut":false,"hidden":false,"merged":[[128,0,128,12],[128,14,128,26],[130,15,131,25],[134,15,134,25],[135,15,135,25],[102,15,103,25],[106,15,106,25],[107,15,107,25],[89,0,89,12],[89,14,89,26],[92,15,93,25],[96,15,96,25],[97,15,97,25],[27,15,28,25],[31,15,31,25],[32,15,32,25],[0,0,1,6],[0,7,1,19],[0,20,1,26],[15,15,15,25],[16,15,16,25],[11,15,12,25],[6,14,6,26],[6,2,6,12],[52,15,52,25],[47,15,48,25],[51,15,51,25],[35,15,36,25],[67,0,67,12],[82,15,82,25],[77,15,78,25],[81,15,81,25],[67,14,67,26],[69,15,70,25],[73,15,73,25],[74,15,74,25],[152,15,152,25],[138,15,139,25],[142,15,142,25],[143,15,143,25],[147,15,148,25],[151,15,151,25],[171,15,171,25],[156,15,157,25],[160,15,160,25],[161,15,161,25],[166,15,167,25],[170,15,170,25]]}
[{"$f":"NCOM&\" (\"&PCOM&\")\"","v":"Comune di Trescore Cremasco (CR)"},null,null,null,null,null,null,{"$f":"IF(INDEX(INT,1,13)=\"\",INDEX(INT,1,1),INDEX(INT,1,13))","v":"Piano di Emergenza Intercomunale di Protezione Civile"},null,null,null,null,null,null,null,null,null,null,null,null,{"$f":"IF(TIPOP=\"Edizione\",\"Ed. \",IF(TIPOP=\"Revisione\",\"Rev. \",\"Bozza \"))&TIPON&\" del \"&TIPOD","v":"Ed. 01 del 04/11/2012"}]
[]
[]
[]
[]
[]
[null,null,"FASI DI ALLERTAMENTO - ATTIVAZIONE",null,null,null,null,null,null,null,null,null,null,null,"PROCEDURE PREVISTE NEL PEC"]
[]
[]
[]
[]
[null,null,null,null,null,null,null,null,null,null,null,null,null,null,null,{"$f":"\"PROCEDURA \"& _RI1","v":"PROCEDURA RI.2"}]
[]
[]
[]
[null,null,null,null,null,null,null,null,null,null,null,null,null,null,null,"PROCEDURE OPERATIVE"]
[null,null,null,null,null,null,null,null,null,null,null,null,null,null,null,{"$f":"RI_2!K186","v":"RI.2.1 - SERVIZIO DI ALLERTA"}]
[]
[]
[]
[]
[]
[]
[]
[]
[]
[]
[null,null,null,null,null,null,null,null,null,null,null,null,null,null,null,{"$f":"\"PROCEDURA \"& _RI2","v":"PROCEDURA RI.3"}]
[]
[]
[]
[null,null,null,null,null,null,null,null,null,null,null,null,null,null,null,"PROCEDURE OPERATIVE"]
[null,null,null,null,null,null,null,null,null,null,null,null,null,null,null,{"$f":"RI_3!H190","v":"RI.3.1 RI.3.2 RI.3.3 - SERVIZIO DI SALVAGUARDIA"}]
[]
[]
[null,null,null,null,null,null,null,null,null,null,null,null,null,null,null,{"$f":"\"PROCEDURA \"& IN","v":"PROCEDURA IN"}]
[]
[]
[]
[]
[]
[]
[]
[]
[]
[]
[]
[null,null,null,null,null,null,null,null,null,null,null,null,null,null,null,{"$f":"\"PROCEDURA \"& _RI3","v":"PROCEDURA RI.4"}]
[]
[]
[]
[null,null,null,null,null,null,null,null,null,null,null,null,null,null,null,"PROCEDURE OPERATIVE"]
[null,null,null,null,null,null,null,null,null,null,null,null,null,null,null,{"$f":"RI_4!H190","v":"RI.4.1 RI.4.2 - SERVIZIO DI SOCCORSO"}]
[]
[]
[]
[]
[]
[]
[]
[]
[]
[]
[]
[]
[]
[]
["FASI DI ATTIVAZIONE",null,null,null,null,null,null,null,null,null,null,null,null,null,"PROCEDURE PREVISTE NEL PEC"]
[]
[null,null,null,null,null,null,null,null,null,null,null,null,null,null,null,{"$f":"\"PROCEDURA \"& _AIB2","v":"PROCEDURA AIB.2"}]
[]
[]
[]
[null,null,null,null,null,null,null,null,null,null,null,null,null,null,null,"PROCEDURE OPERATIVE"]
[null,null,null,null,null,null,null,null,null,null,null,null,null,null,null,{"$f":"AIB_2!P211","v":"AIB.2.1 - SUPPORTO DOS"}]
[]
[]
[null,null,null,null,null,null,null,null,null,null,null,null,null,null,null,{"$f":"\"PROCEDURA \"& _AIB3","v":"PROCEDURA AIB.3"}]
[]
[]
[]
[null,null,null,null,null,null,null,null,null,null,null,null,null,null,null,"PROCEDURE OPERATIVE"]
[null,null,null,null,null,null,null,null,null,null,null,null,null,null,null,{"$f":"AIB_3!H190","v":"AIB.3.1 AIB.3.2 AIB.3.3 - INCENDIO DI INTERFACCIA"}]
[]
[]
[]
[]
[]
[]
["FASI DI ATTIVAZIONE",null,null,null,null,null,null,null,null,null,null,null,null,null,"PROCEDURE PREVISTE NEL PEC"]
[]
[]
[null,null,null,null,null,null,null,null,null,null,null,null,null,null,null,{"$f":"\"PROCEDURA \"& _RT2","v":"PROCEDURA RS.2"}]
[]
[]
[]
[null,null,null,null,null,null,null,null,null,null,null,null,null,null,null,"PROCEDURE OPERATIVE"]
[null,null,null,null,null,null,null,null,null,null,null,null,null,null,null,{"$f":"RS_2!K190","v":"RS.2.1 - FASE DI ALLARME"}]
[]
[]
[]
[]
[null,null,null,null,null,null,null,null,null,null,null,null,null,null,null,{"$f":"\"PROCEDURA \"& _RT3","v":"PROCEDURA RS.3"}]
[]
[]
[]
[null,null,null,null,null,null,null,null,null,null,null,null,null,null,null,"PROCEDURE OPERATIVE"]
[null,null,null,null,null,null,null,null,null,null,null,null,null,null,null,{"$f":"RS_3!H190","v":"RS.3.1 RS.3.2 RS.3.3 RS.3.4 - AZIONI DI SALVAGUARDIA"}]
[]
[]
[]
[]
[]
[]
[]
[]
[]
[]
[]
[]
[]
[]
[]
[]
[]
[]
[]
[]
["FASI DI ATTIVAZIONE",null,null,null,null,null,null,null,null,null,null,null,null,null,"PROCEDURE PREVISTE NEL PEC"]
[]
[null,null,null,null,null,null,null,null,null,null,null,null,null,null,null,{"$f":"\"PROCEDURA \"& _IRI3","v":"PROCEDURA IR.3"}]
[]
[]
[]
[null,null,null,null,null,null,null,null,null,null,null,null,null,null,null,"PROCEDURE OPERATIVE"]
[null,null,null,null,null,null,null,null,null,null,null,null,null,null,null,{"$f":"IR_3!H190","v":"IR.3.1 IR.3.2 IR.3.3 IR.3.4 - AZIONI DI SALVAGUARDIA"}]
[]
[]
[null,null,null,null,null,null,null,null,null,null,null,null,null,null,null,{"$f":"\"PROCEDURA \"& _RG2","v":"PROCEDURA RG.2"}]
[]
[]
[]
[null,null,null,null,null,null,null,null,null,null,null,null,null,null,null,"PROCEDURE OPERATIVE"]
[null,null,null,null,null,null,null,null,null,null,null,null,null,null,null,{"$f":"RG_2!H190","v":"RG.2.1 RG.2.2 RG.2.3 - AZIONI DI SALVAGUARDIA"}]
[]
[]
[]
[null,null,null,null,null,null,null,null,null,null,null,null,null,null,null,{"$f":"\"PROCEDURA \"& _RG3","v":"PROCEDURA RG.3"}]
[]
[]
[]
[null,null,null,null,null,null,null,null,null,null,null,null,null,null,null,"PROCEDURE OPERATIVE"]
[null,null,null,null,null,null,null,null,null,null,null,null,null,null,null,{"$f":"RG_3!H190","v":"RG.3.1 RG.3.2 RG.3.3 - AZIONI DI SALVAGUARDIA"}]
[]
[]
[]
[null,null,null,null,null,null,null,null,null,null,null,null,null,null,null,{"$f":"\"PROCEDURA \"& _MRI3","v":"PROCEDURA MR.3"}]
[]
[]
[]
[null,null,null,null,null,null,null,null,null,null,null,null,null,null,null,"PROCEDURE OPERATIVE"]
[null,null,null,null,null,null,null,null,null,null,null,null,null,null,null,{"$f":"MR_3!H190","v":"MR.3.1 MR.3.2 MR.3.3 MR.3.4 - AZIONI DI SALVAGUARDIA"}]
[]
[]
[]
[]
[null,null,null,null,null,null,null,null,null,null,null,null,null,null,null,{"$f":"\"PROCEDURA \"&IV","v":"PROCEDURA IV.3"}]
[]
[]
[]
[null,null,null,null,null,null,null,null,null,null,null,null,null,null,null,"PROCEDURE OPERATIVE"]
[null,null,null,null,null,null,null,null,null,null,null,null,null,null,null,{"$f":"IV_3!K190","v":"IV.3.1 - AZIONI DI SALVAGUARDIA"}]

{"sheet":"RI_2","index":1,"n_rows":214,"n_cols":27,"rows_kept":214,"cut":false,"hidden":false,"merged":[[20,10,21,24],[22,1,24,9],[34,10,38,24],[25,10,29,24],[20,1,21,9],[10,10,13,24],[14,10,15,24],[0,0,1,6],[0,7,1,18],[0,19,1,25],[3,0,4,22],[3,23,6,25],[5,0,6,22],[9,10,9,24],[10,1,15,9],[16,1,19,9],[16,10,19,24],[8,1,8,9],[8,10,8,24],[9,1,9,9],[42,1,44,9],[42,10,42,24],[43,10,43,24],[44,10,44,24],[45,1,48,9],[45,10,45,24],[46,10,46,24],[47,10,47,24],[48,10,48,24],[39,1,41,9],[39,10,39,24],[40,10,40,24],[41,10,41,24],[22,10,22,16],[23,10,23,16],[24,10,24,16],[22,17,24,24],[25,1,29,9],[30,1,33,9],[30,10,33,24],[34,1,38,9],[49,1,50,9],[49,10,50,24],[51,1,53,9],[51,11,51,24],[52,11,52,24],[53,11,53,24],[60,10,60,24],[59,1,59,9],[59,10,59,24],[54,1,58,9],[54,10,58,24],[60,1,61,9],[61,10,61,24],[123,23,126,25],[125,0,126,22],[128,0,130,4],[128,5,130,10],[128,11,128,25],[129,11,130,14],[63,0,64,22],[63,23,66,25],[65,0,66,22],[123,0,124,22],[132,26,140,26],[134,0,136,4],[134,5,136,10],[134,11,134,14],[134,15,136,18],[134,19,136,22],[135,11,135,14],[136,11,136,14],[140,15,140,18],[140,19,140,22],[140,23,140,25],[139,23,139,25],[140,0,140,4],[140,5,140,10],[140,11,140,14],[139,0,139,4],[139,5,139,10],[139,11,139,14],[139,15,139,18],[139,19,139,22],[132,0,133,4],[132,5,133,10],[132,11,133,14],[132,15,133,18],[141,0,142,4],[141,5,142,10],[141,11,142,14],[141,15,142,18],[141,19,142,22],[141,23,142,25],[144,0,147,4],[144,5,147,10],[144,11,144,14],[144,15,144,18],[144,19,147,22],[144,23,147,25],[143,0,143,4],[143,5,143,10],[143,11,143,14],[143,15,143,18],[143,19,143,22],[143,23,143,25],[144,26,147,26],[145,11,145,14],[145,15,145,18],[146,11,146,14],[146,15,146,18],[147,11,147,14],[147,15,147,18],[148,0,148,25],[149,0,151,4],[149,5,151,10],[149,11,151,14],[149,15,151,18],[149,19,149,22],[149,23,151,25],[150,19,150,22],[151,19,151,22],[152,0,152,25],[153,0,155,4],[153,5,155,10],[153,11,155,14],[153,15,155,18],[153,19,153,22],[153,23,155,25],[156,11,156,14],[156,15,156,18],[156,19,156,22],[156,23,156,25],[155,19,155,22],[154,19,154,22],[187,1,190,24],[185,1,185,9],[156,0,156,4],[156,5,156,10],[186,1,186,24],[157,0,160,4],[157,5,160,10],[157,11,160,14],[157,15,160,18],[157,19,160,22],[157,23,160,25],[179,0,180,22],[185,10,185,24],[179,23,182,25],[181,0,182,22],[184,1,184,9],[184,10,184,24],[162,0,162,25],[211,3,211,14],[194,1,194,9],[194,10,194,24],[205,3,205,14],[206,3,206,14],[208,3,208,14],[210,15,210,23],[208,15,208,23],[204,15,204,23],[201,15,201,23],[202,15,202,23],[213,3,213,14],[212,15,212,23],[207,15,207,23],[213,15,213,23],[191,10,191,24],[191,1,191,9],[211,15,211,23],[205,15,205,23],[206,15,206,23],[192,1,192,9],[192,10,192,24],[193,1,193,9],[193,10,193,24],[203,3,203,14],[204,3,204,14],[209,15,209,23],[209,3,209,14],[210,3,210,14],[207,3,207,14],[212,3,212,14],[203,15,203,23],[195,1,196,9],[195,10,196,24],[201,2,202,14],[135,23,135,24],[137,0,138,4],[137,5,138,10],[137,11,138,14],[137,15,138,18],[137,19,138,22],[132,19,133,22],[132,23,133,25],[129,15,130,18],[131,0,131,4],[131,5,131,10],[131,11,131,14],[131,15,131,18],[131,19,131,22],[131,23,131,25],[129,19,130,22],[129,23,130,25]]}
[{"$f":"NCOM&\" (\"&PCOM&\")\"","v":"Comune di Trescore Cremasco (CR)"},null,null,null,null,null,null,{"$f":"IF(INDEX(INT,1,13)=\"\",INDEX(INT,1,1),INDEX(INT,1,13))","v":"Piano di Emergenza Intercomunale di Protezione Civile"},null,null,null,null,null,null,null,null,null,null,null,{"$f":"IF(TIPOP=\"Edizione\",\"Ed. \",IF(TIPOP=\"Revisione\",\"Rev. \",\"Bozza \"))&TIPON&\" del \"&TIPOD","v":"Ed. 01 del 04/11/2012"}]
[]
[]
["Scheda Scenario",null,null,null,null,null,null,null,null,null,null,null,null,null,null,null,null,null,null,null,null,null,null,{"$f":"_RI1","v":"RI.2"}]
[]
[{"$f":"IF(INDEX(RI1PAR,1,19)=\"\",INDEX(RI1PAR,1,12),INDEX(RI1PAR,1,19))&\" - Fase di Allerta - Codice 2\"","v":"Rischio Idrogeologico - Fase di Allerta - Codice 2"}]
[]
[]
[null,"Paragrafi di Riferimento Tomo Verde",null,null,null,null,null,null,null,null,{"$f":"INDEX(RI1PAR,1,1)&INDEX(RI1PAR,1,12)","v":"2.2.1 - 2.2.2 - 3.3.1 Procedure per il Rischio Idrogeologico"}]
[null,"Codice Scheda Procedura UCL",null,null,null,null,null,null,null,null,{"$f":"X4","v":"RI.2"}]
[null,"Evento atteso",null,null,null,null,null,null,null,null,"Scenari di rischio approfonditi nel Piano di Emeregenza e qualsiasi tipologia di dissesto idrogeologico non atteso che si sia verificato o che si stia verificando e che, di conseguenza, non sia stato pianificato nello specifico."]
[]
[]
[]
[null,null,null,null,null,null,null,null,null,null,"Ricezione di avviso di Allerta Meteo per criticità Moderata da Regione Lombardia."]
[]
[null,"Attività U.C.L.",null,null,null,null,null,null,null,null,"Attivazione Servizio di Allerta con finalità di monitoraggio delle aree sensibili individuate sul territorio."]
[]
[]
[]
[null,"Ubicazione intervento",null,null,null,null,null,null,null,null,"Aree identificate."]
[]
[null,"Personale mobilitato",null,null,null,null,null,null,null,null,{"$f":"IF(INDEX(RI1PER,1,1)=\"\",\"\",\"- \"&VLOOKUP(INDEX(RI1PER,1,1),Personale,IF(INDEX(Personale,INDEX(RI1PER,1,1),14)=\"\",2,14)))","v":"- Polizia Locale"},null,null,null,null,null,null,"Riportare la composizione delle squadre nel Modulo M1"]
[null,null,null,null,null,null,null,null,null,null,{"$f":"IF(INDEX(RI1PER,1,2)=\"\",\"\",\"- \"&VLOOKUP(INDEX(RI1PER,1,2),Personale,IF(INDEX(Personale,INDEX(RI1PER,1,2),14)=\"\",2,14)))","v":"- Volontari P.C."}]
[null,null,null,null,null,null,null,null,null,null,{"$f":"IF(INDEX(RI1PER,1,3)=\"\",\"\",\"- \"&VLOOKUP(INDEX(RI1PER,1,3),Personale,IF(INDEX(Personale,INDEX(RI1PER,1,3),14)=\"\",2,14)))","v":"- Tecnici/Operai Comunali"}]
[null,"Attività personale mobilitato",null,null,null,null,null,null,null,null,"Monitoraggio dell’evolversi del fenomeno sotto forma di presidio costante o perlustrazione. Le aree che devono essere messe sotto controllo dal Servizio di Allerta sono decise dall'UCL sulla base di quanto previsto dal Piano di Emergenza."]
[]
[]
[]
[]
[null,"Grado di coinvolgimento della popolazione",null,null,null,null,null,null,null,null,"Dipende dall’ampiezza della zona colpita. Nel caso si decida di porre dei presidi o dei cancelli sul territorio, si procede ad informare la popolazione potenzialmente interessata."]
[]
[]
[]
[null,"Cancelli e vie alternative",null,null,null,null,null,null,null,null,"Se una particolare situazione di monitoraggio lo richiede vengono posizionati dei cancelli finalizzati alla regolazione del traffico nelle zone interessate."]
[]
[]
[]
[]
[null,"Aree di raccolta popolazione",null,null,null,null,null,null,null,null,{"$f":"IF(INDEX(RI1RIC,1,1)=\"\",\"In questa fase non è prevista l’attivazione di tali aree.\",\"Per questa emergenza \"&IF(INDEX(RI1RIC,1,2)=\"\",\"è disponibile la seguente area:\",\"sono disponibili le seguenti aree:\"))","v":"In questa fase non è prevista l’attivazione di tali aree."}]
[null,null,null,null,null,null,null,null,null,null,{"$f":"IF(INDEX(RI1RIC,1,1)=\"\",\"\",\"- \"&VLOOKUP(INDEX(RI1RIC,1,1),Ricovero,2))","v":""}]
[null,null,null,null,null,null,null,null,null,null,{"$f":"IF(INDEX(RI1RIC,1,2)=\"\",\"\",\"- \"&VLOOKUP(INDEX(RI1RIC,1,2),Ricovero,2))","v":""}]
[null,"Area di ricovero",null,null,null,null,null,null,null,null,{"$f":"IF(INDEX(RI1RIC,1,3)=\"\",\"\",\"- \"&VLOOKUP(INDEX(RI1RIC,1,3),Ricovero,2))","v":""}]
[null,null,null,null,null,null,null,null,null,null,{"$f":"IF(INDEX(RI1RIC,1,4)=\"\",\"\",\"- \"&VLOOKUP(INDEX(RI1RIC,1,4),Ricovero,2))","v":""}]
[null,null,null,null,null,null,null,null,null,null,{"$f":"IF(K42=\"\",\"\",\"In funzione della gravità della situazione si decide quali/quante aree attivare.\")","v":""}]
[null,"Area di raduno soccorritori",null,null,null,null,null,null,null,null,{"$f":"IF(INDEX(RI1SOC,1,1)=\"\",\"In questa fase non è prevista l’attivazione di tali aree.\",\"Per questa emergenza \"&IF(INDEX(RI1SOC,1,2)=\"\",\"è disponibile la seguente area:\",\"sono disponibili le seguenti aree:\"))","v":"In questa fase non è prevista l’attivazione di tali aree."}]
[null,null,null,null,null,null,null,null,null,null,{"$f":"IF(INDEX(RI1SOC,1,1)=\"\",\"\",\"- \"&VLOOKUP(INDEX(RI1SOC,1,1),Soccorritori,2))","v":""}]
[null,null,null,null,null,null,null,null,null,null,{"$f":"IF(INDEX(RI1SOC,1,2)=\"\",\"\",\"- \"&VLOOKUP(INDEX(RI1SOC,1,2),Soccorritori,2))","v":""}]
[null,null,null,null,null,null,null,null,null,null,{"$f":"IF(K47=\"\",\"\",\"In funzione della gravità della situazione si decide quali/quante aree attivare.\")","v":""}]
[null,"Ordinanze Necessarie",null,null,null,null,null,null,null,null,"Nessuna"]
[]
[null,"Modalita’ Riunione U.C.L.",null,null,null,null,null,null,null,null,"X","Non necessaria"]
[null,null,null,null,null,null,null,null,null,null,null,"Virtuale"]
[null,null,null,null,null,null,null,null,null,null,null,"In sede"]
[null,"Possibili Scenari Concomitanti",null,null,null,null,null,null,null,null,"Non ragionevolmente prevedibile la concomitanza con altri eventi."]
[]
[]
[]
[]
[null,"Contatti Utili",null,null,null,null,null,null,null,null,{"$f":"\"Consultare il \"&IF([1]Maschera!Z71=\"\",[1]Maschera!N71,[1]Maschera!Z71)","v":"Consultare il Tomo Giallo - Risorse"}]
[null,"Cartografia",null,null,null,null,null,null,null,null,{"$f":"INDEX(RI1PAR,1,28)","v":"Tav. 3/A - Rischio Idrogeologico"}]
[null,null,null,null,null,null,null,null,null,null,{"$f":"INDEX(RI1PAR,1,39)","v":"Tav. 3/D - Stradario Piano di Emergenza"}]
[]
["Procedure U.C.L.",null,null,null,null,null,null,null,null,null,null,null,null,null,null,null,null,null,null,null,null,null,null,{"$f":"_RI1","v":"RI.2"}]
[]
[{"$f":"$A$6","v":"Rischio Idrogeologico - Fase di Allerta - Codice 2"}]
[]
[]
[]
[]
[]
[]
[]
[]
[]
[]
[]
[]
[]
[]
[]
[]
[]
[]
[]
[]
[]
[]
[]
[]
[]
[]
[]
[]
[]
[]
[]
[]
[]
[]
[]
[]
[]
[]
[]
[]
[]
[]
[]
[]
[]
[]
[]
[]
[]
[]
[]
[]
[]
[]
[]
[]
[]
["Procedure U.C.L.",null,null,null,null,null,null,null,null,null,null,null,null,null,null,null,null,null,null,null,null,null,null,{"$f":"X4","v":"RI.2"}]
[]
[{"$f":"$A$6","v":"Rischio Idrogeologico - Fase di Allerta - Codice 2"}]
[]
[]
["RESPONSABILE",null,null,null,null,"AZIONE",null,null,null,null,null,"CHIAMATE"]
[null,null,null,null,null,null,null,null,null,null,null,"MEMBRO UCL",null,null,null,"OPERATIVI",null,null,null,"ENTE INTERESSATO",null,null,null,"SCHEDE CHIAMATE"]
[]
[{"$f":"IF(INDEX(Sindaco,1,9)=\"\",INDEX(Sindaco,1,1),INDEX(Sindaco,1,9))","v":"SINDACO / R.O.C."},null,null,null,null,"Avvisa della Fase di Allerta Codice 2.",null,null,null,null,null,"- Sindaco",null,null,null,"--",null,null,null,"--",null,null,null,"O1 - O2"]
[{"$f":"IF(INDEX(Sindaco,1,9)=\"\",INDEX(Sindaco,1,1),INDEX(Sindaco,1,9))","v":"SINDACO / R.O.C."},null,null,null,null,{"$f":"\"Avvisa della Fase di Allerta Codice 2 e attiva il Servizio di Allerta. \"&_RI1&\".1\"","v":"Avvisa della Fase di Allerta Codice 2 e attiva il Servizio di Allerta. RI.2.1"},null,null,null,null,null,"- Tutti",null,null,null,"--",null,null,null,"--",null,null,null,"O1 - O2",null,null,{"$f":"_RI1&\".1\"","v":"RI.2.1"}]
[]
[{"$f":"IF(INDEX(PL,1,9)=\"\",INDEX(PL,1,1),INDEX(PL,1,9))","v":"POLIZIA LOCALE"},null,null,null,null,{"$f":"\"Responsabile \"&_RI1&\".1\"","v":"Responsabile RI.2.1"},null,null,null,null,null,{"$f":"\"- \"&PROPER(IF(INDEX(RT,1,9)=\"\",INDEX(RT,1,1),INDEX(RT,1,9)))","v":"- Resp. Territorio"},null,null,null,{"$f":"\"- \"&IF(INDEX(PLO,1,9)=\"\",INDEX(PLO,1,1),INDEX(PLO,1,9))","v":"- Agenti P.L."},null,null,null,"--"]
[null,null,null,null,null,null,null,null,null,null,null,{"$f":"\"- \"&PROPER(IF(INDEX(CV,1,9)=\"\",INDEX(CV,1,1),INDEX(CV,1,9)))","v":"- C. Volontariato"},null,null,null,null,null,null,null,null,null,null,null,"O1 - O2",null,"A2.2"]
[null,null,null,null,null,null,null,null,null,null,null,{"$f":"\"- \"&PROPER(IF(INDEX(CC,1,9)=\"\",INDEX(CC,1,1),INDEX(CC,1,9)))","v":"- C. Carabinieri"}]
[{"$f":"IF(INDEX(RT,1,9)=\"\",INDEX(RT,1,1),INDEX(RT,1,9))","v":"RESP. TERRITORIO"},null,null,null,null,{"$f":"\"Responsabile \"&_RI1&\".1\"","v":"Responsabile RI.2.1"},null,null,null,null,null,"--",null,null,null,{"$f":"\"- \"&IF(INDEX(TCO,1,9)=\"\",INDEX(TCO,1,1),INDEX(TCO,1,9))","v":"- Tecnici Comunali"},null,null,null,"--",null,null,null,"A2.1","A4","A5"]
[null,null,null,null,null,null,null,null,null,null,null,null,null,null,null,null,null,null,null,null,null,null,null,"B2","B4","C1"]
[{"$f":"IF(INDEX(CV,1,9)=\"\",INDEX(CV,1,1),INDEX(CV,1,9))","v":"C. VOLONTARIATO"},null,null,null,null,{"$f":"\"Coadiuva \"&_RI1&\".1\"","v":"Coadiuva RI.2.1"},null,null,null,null,null,"--",null,null,null,{"$f":"\"- \"&IF(INDEX(VO,1,9)=\"\",INDEX(VO,1,1),INDEX(VO,1,9))","v":"- Gruppi Volontari"},null,null,null,"--",null,null,null,"A3 - B3"]
[{"$f":"IF(INDEX(CC,1,9)=\"\",INDEX(CC,1,1),INDEX(CC,1,9))","v":"C. CARABINIERI"},null,null,null,null,{"$f":"\"Coadiuva \"&_RI1&\".1\"","v":"Coadiuva RI.2.1"},null,null,null,null,null,"--",null,null,null,{"$f":"\"- \"&IF(INDEX(CO,1,9)=\"\",INDEX(CO,1,1),INDEX(CO,1,9))","v":"- Carabinieri"},null,null,null,"--",null,null,null,"--"]
[{"$f":"IF(INDEX(PL,1,9)=\"\",INDEX(PL,1,1),INDEX(PL,1,9))","v":"POLIZIA LOCALE"},null,null,null,null,"Riferisce le informazioni raccolte dal Servizio di Allerta.",null,null,null,null,null,{"$f":"\"- \"&PROPER(IF(INDEX(ROC,1,9)=\"\",INDEX(ROC,1,1),INDEX(ROC,1,9)))","v":"- R.O.C."},null,null,null,"--",null,null,null,"--",null,null,null,"O1 - O2"]
[]
[{"$f":"IF(INDEX(ROC,1,9)=\"\",INDEX(ROC,1,1),INDEX(ROC,1,9))","v":"R.O.C."},null,null,null,null,"Informa periodicamente sulla situazione.",null,null,null,null,null,"- Sindaco",null,null,null,"--",null,null,null,"--",null,null,null,"O1 - O2"]
[{"$f":"IF(INDEX(ROC,1,9)=\"\",INDEX(ROC,1,1),INDEX(ROC,1,9))","v":"R.O.C."},null,null,null,null,{"$f":"\"A ragion veduta reitera la procedura \"&_RI1&\".1\"","v":"A ragion veduta reitera la procedura RI.2.1"},null,null,null,null,null,{"$f":"\"- \"&PROPER(IF(INDEX(RT,1,9)=\"\",INDEX(RT,1,1),INDEX(RT,1,9)))","v":"- Resp. Territorio"},null,null,null,{"$f":"\"- \"&IF(INDEX(PLO,1,9)=\"\",INDEX(PLO,1,1),INDEX(PLO,1,9))","v":"- Agenti P.L."},null,null,null,"--",null,null,null,"O1 - O2",null,null,{"$f":"_RI1&\".1\"","v":"RI.2.1"}]
[null,null,null,null,null,null,null,null,null,null,null,{"$f":"\"- \"&PROPER(IF(INDEX(CV,1,9)=\"\",INDEX(CV,1,1),INDEX(CV,1,9)))","v":"- C. Volontariato"},null,null,null,{"$f":"\"- \"&IF(INDEX(TCO,1,9)=\"\",INDEX(TCO,1,1),INDEX(TCO,1,9))","v":"- Tecnici Comunali"}]
[null,null,null,null,null,null,null,null,null,null,null,{"$f":"\"- \"&PROPER(IF(INDEX(CC,1,9)=\"\",INDEX(CC,1,1),INDEX(CC,1,9)))","v":"- C. Carabinieri"},null,null,null,{"$f":"\"- \"&IF(INDEX(VO,1,9)=\"\",INDEX(VO,1,1),INDEX(VO,1,9))","v":"- Gruppi Volontari"}]
[null,null,null,null,null,null,null,null,null,null,null,{"$f":"\"- \"&PROPER(IF(INDEX(PL,1,9)=\"\",INDEX(PL,1,1),INDEX(PL,1,9)))","v":"- Polizia Locale"},null,null,null,{"$f":"\"- \"&IF(INDEX(CO,1,9)=\"\",INDEX(CO,1,1),INDEX(CO,1,9))","v":"- Carabinieri"}]
["VERIFICA POSITIVA O EMANAZIONE DI AVVISO DI CRITICITA’ ELEVATA"]
[{"$f":"IF(INDEX(Sindaco,1,9)=\"\",INDEX(Sindaco,1,1),INDEX(Sindaco,1,9))","v":"SINDACO / R.O.C."},null,null,null,null,"Avvisa della Fase di Allerta Codice 3.",null,null,null,null,null,"--",null,null,null,"--",null,null,null,{"$f":"\"- \"&IF(INDEX(PR,1,9)=\"\",INDEX(PR,1,1),INDEX(PR,1,9))","v":"- Prefettura"},null,null,null,"C2.1 - C2.3 C2.4"]
[null,null,null,null,null,null,null,null,null,null,null,null,null,null,null,null,null,null,null,{"$f":"\"- \"&IF(INDEX(PRO,1,9)=\"\",INDEX(PRO,1,1),INDEX(PRO,1,9))","v":"- Provincia"}]
[null,null,null,null,null,null,null,null,null,null,null,null,null,null,null,null,null,null,null,{"$f":"\"- \"&IF(INDEX(REG,1,9)=\"\",INDEX(REG,1,1),INDEX(REG,1,9))","v":"- Regione"}]
["VERIFICA NEGATIVA E/O REVOCA DELL’AVVISO DI CRITICITA’ MODERATO"]
[{"$f":"IF(INDEX(Sindaco,1,9)=\"\",INDEX(Sindaco,1,1),INDEX(Sindaco,1,9))","v":"SINDACO / R.O.C."},null,null,null,null,"Avvisa della cessazione della Fase di  Allerta Codice 2.",null,null,null,null,null,"--",null,null,null,"--",null,null,null,{"$f":"\"- \"&IF(INDEX(PR,1,9)=\"\",INDEX(PR,1,1),INDEX(PR,1,9))","v":"- Prefettura"},null,null,null,"C2.1  C2.4"]
[null,null,null,null,null,null,null,null,null,null,null,null,null,null,null,null,null,null,null,{"$f":"\"- \"&IF(INDEX(PRO,1,9)=\"\",INDEX(PRO,1,1),INDEX(PRO,1,9))","v":"- Provincia"}]
[null,null,null,null,null,null,null,null,null,null,null,null,null,null,null,null,null,null,null,{"$f":"\"- \"&IF(INDEX(REG,1,9)=\"\",INDEX(REG,1,1),INDEX(REG,1,9))","v":"- Regione"}]
[{"$f":"IF(INDEX(Sindaco,1,9)=\"\",INDEX(Sindaco,1,1),INDEX(Sindaco,1,9))","v":"SINDACO / R.O.C."},null,null,null,null,"Avvisa della Cessata Allerta Codice 2.",null,null,null,null,null,"- Tutti",null,null,null,"--",null,null,null,"--",null,null,null,"O1 - O2"]
[{"$f":"IF(INDEX(PL,1,9)=\"\",INDEX(PL,1,1),INDEX(PL,1,9))","v":"POLIZIA LOCALE"},null,null,null,null,"Se informato della Cessata Allerta Codice 2 dispone il rientro delle squadre.",null,null,null,null,null,"--",null,null,null,{"$f":"\"- \"&IF(INDEX(SC,1,9)=\"\",INDEX(SC,1,1),INDEX(SC,1,9))","v":"- Squadre Operativi"},null,null,null,"--",null,null,null,"M1"]
[]
[]
[]
[]
["PER LE COMUNICAZIONI EVIDENZIATE IN ROSSO UTILIZZARE IL MODULO FAX M4"]
[]
[]
[]
[]
[]
[]
[]
[]
[]
[]
[]
[]
[]
[]
[]
[]
["Scheda Procedura Operativa",null,null,null,null,null,null,null,null,null,null,null,null,null,null,null,null,null,null,null,null,null,null,{"$f":"X4","v":"RI.2"}]
[]
[{"$f":"$A$6","v":"Rischio Idrogeologico - Fase di Allerta - Codice 2"}]
[]
[]
[null,"Codice Scheda Scenario",null,null,null,null,null,null,null,null,{"$f":"X4","v":"RI.2"}]
[null,"Tipo di Procedure",null,null,null,null,null,null,null,null,{"$f":"_RI1&\".1 - SERVIZIO DI ALLERTA\"","v":"RI.2.1 - SERVIZIO DI ALLERTA"}]
[null,"Ubicazione intervento"]
[null,"Dal momento che nell'analisi delle pericolosità non sono emerse particolari criticità per il rischio idrogeologico si considera potenzialmente da sottoporre a monitoraggio l'intero territorio comunale."]
[]
[]
[]
[null,"Aree di raccolta popolazione",null,null,null,null,null,null,null,null,{"$f":"K40","v":"In questa fase non è prevista l’attivazione di tali aree."}]
[null,"Aree di ricovero",null,null,null,null,null,null,null,null,{"$f":"K43","v":""}]
[null,"Aree di raduno soccorritori",null,null,null,null,null,null,null,null,{"$f":"K46","v":"In questa fase non è prevista l’attivazione di tali aree."}]
[null,"Cancelli e vie alternative",null,null,null,null,null,null,null,null," --"]
[null,"Contatti Utili",null,null,null,null,null,null,null,null,"Si faccia riferimento al PRONTUARIO DI EMERGENZA - CONTATTI"]
[]
[]
[]
[]
[]
[null,null,"Procedura Operativa Standard (POS)",null,null,null,null,null,null,null,null,null,null,null,null,"Procedure Previste"]
[null,null,null,null,null,null,null,null,null,null,null,null,null,null,null,{"$f":"K186","v":"RI.2.1 - SERVIZIO DI ALLERTA"}]
[null,null,1,"Monitoraggio",null,null,null,null,null,null,null,null,null,null,null,"X"]
[null,null,2,"Perlustrazione",null,null,null,null,null,null,null,null,null,null,null,"X"]
[null,null,3,"Presidio Cancelli/Supporto Viabilità",null,null,null,null,null,null,null,null,null,null,null,"--"]
[null,null,4,"Informazione Diretta alla Popolazione",null,null,null,null,null,null,null,null,null,null,null,"X"]
[null,null,5,"Allestimento Area di Ricovero",null,null,null,null,null,null,null,null,null,null,null,"--"]
[null,null,6,"Allestimento Area di Ammassamento Soccorsi",null,null,null,null,null,null,null,null,null,null,null,"--"]
[null,null,7,"Evacuazione",null,null,null,null,null,null,null,null,null,null,null,"--"]
[null,null,8,"Rimozione Ostacoli",null,null,null,null,null,null,null,null,null,null,null,"--"]
[null,null,9,"Rimozione Ostacoli da Alveo",null,null,null,null,null,null,null,null,null,null,null,"X"]
[null,null,10,"Preservazione Argini",null,null,null,null,null,null,null,null,null,null,null,"--"]
[null,null,11,"Frana",null,null,null,null,null,null,null,null,null,null,null,"--"]

{"sheet":"RI_3","index":2,"n_rows":227,"n_cols":27,"rows_kept":227,"cut":false,"hidden":false,"merged":[[45,5,45,24],[46,5,46,24],[47,5,47,24],[48,5,48,24],[200,1,204,6],[205,1,206,6],[207,1,209,6],[205,7,206,24],[207,7,209,24],[197,7,197,24],[198,7,198,24],[199,7,199,24],[200,7,200,24],[201,7,201,24],[202,7,202,24],[203,7,203,24],[204,7,204,24],[50,1,51,9],[50,10,50,24],[51,10,51,24],[52,1,54,9],[52,11,52,24],[53,11,53,24],[54,11,54,24],[191,1,194,6],[195,1,199,6],[191,7,191,24],[192,7,192,24],[193,7,193,24],[194,7,194,24],[195,7,195,24],[196,7,196,24],[37,1,40,4],[41,1,44,4],[45,1,49,4],[37,5,37,24],[38,5,38,24],[39,5,39,24],[49,5,49,24],[40,5,40,24],[41,5,41,24],[42,5,42,24],[43,5,43,24],[44,5,44,24],[128,5,130,10],[128,11,128,25],[129,11,130,14],[129,15,130,18],[34,10,36,24],[23,1,25,9],[26,1,29,9],[26,10,29,24],[23,17,25,24],[23,10,23,16],[24,10,24,16],[25,10,25,16],[30,10,32,24],[33,10,33,24],[30,1,33,9],[34,1,36,9],[0,0,1,6],[0,7,1,18],[0,19,1,25],[3,0,4,22],[3,23,6,25],[5,0,6,22],[16,1,20,9],[16,10,20,24],[21,1,22,9],[21,10,22,24],[8,1,8,9],[8,10,8,24],[9,1,9,9],[9,10,9,24],[10,1,15,9],[10,10,13,24],[14,10,15,24],[129,19,130,22],[129,23,130,25],[60,10,60,24],[55,1,58,9],[55,10,58,24],[59,1,59,9],[59,10,59,24],[123,0,124,22],[123,23,126,25],[125,0,126,22],[128,0,130,4],[63,0,64,22],[63,23,66,25],[65,0,66,22],[60,1,61,9],[61,10,61,24],[132,19,132,22],[137,23,140,25],[138,19,138,22],[139,19,139,22],[140,19,140,22],[131,0,133,4],[131,5,133,10],[131,11,133,14],[131,15,133,18],[131,19,131,22],[137,0,140,4],[137,5,140,10],[137,11,140,14],[137,15,140,18],[137,19,137,22],[131,23,131,25],[134,23,136,25],[135,0,136,4],[133,19,133,22],[134,0,134,4],[134,5,136,10],[134,11,136,14],[134,15,136,18],[134,19,136,22],[149,11,149,14],[149,15,149,18],[149,19,149,22],[141,26,150,26],[142,11,142,14],[143,11,143,14],[143,19,143,22],[144,11,144,14],[144,19,144,22],[147,11,147,14],[147,15,148,18],[147,19,148,22],[147,23,148,25],[151,23,153,25],[152,11,152,14],[153,11,153,14],[141,0,146,4],[141,5,146,10],[141,15,146,18],[141,23,146,25],[147,0,148,4],[147,5,148,10],[148,11,148,14],[150,5,150,10],[150,11,150,14],[150,15,150,18],[150,19,150,22],[150,23,150,25],[151,0,153,4],[151,5,153,10],[151,11,151,14],[151,15,153,18],[151,19,153,22],[149,23,149,25],[150,0,150,4],[149,0,149,4],[149,5,149,10],[165,19,165,22],[154,0,157,4],[154,5,157,10],[154,15,157,18],[154,19,157,22],[154,26,159,26],[155,11,155,14],[156,11,156,14],[158,0,158,4],[158,5,158,10],[158,11,158,14],[158,15,158,18],[158,19,158,22],[158,23,158,25],[159,0,159,4],[159,5,159,10],[159,11,159,14],[159,15,159,18],[159,19,159,22],[154,23,154,24],[159,23,159,24],[160,23,162,25],[163,23,163,25],[160,26,166,26],[161,11,161,14],[162,11,162,14],[163,0,164,4],[163,5,164,10],[163,11,163,14],[163,15,164,18],[163,19,164,22],[166,23,166,25],[160,0,162,4],[160,5,162,10],[160,11,160,14],[160,15,162,18],[160,19,162,22],[164,11,164,14],[165,0,165,4],[166,11,166,14],[166,15,166,18],[166,19,166,22],[165,5,165,10],[165,11,165,14],[165,15,165,18],[172,0,175,4],[172,5,175,10],[172,11,175,14],[172,15,175,18],[172,19,172,22],[173,19,173,22],[174,19,174,22],[175,19,175,22],[168,19,168,22],[169,19,169,22],[170,19,170,22],[167,0,170,4],[167,5,170,10],[167,11,170,14],[167,15,170,18],[167,19,167,22],[221,21,221,23],[223,18,223,20],[223,21,223,23],[223,15,223,17],[165,23,165,25],[166,0,166,4],[166,5,166,10],[183,0,184,22],[183,23,186,25],[185,0,186,22],[188,7,188,24],[189,7,189,24],[190,7,190,24],[188,1,188,6],[189,1,189,6],[190,1,190,6],[177,11,179,14],[177,15,179,18],[177,19,179,22],[181,0,181,25],[177,23,177,25],[173,23,173,25],[167,23,170,25],[171,0,171,25],[226,15,226,17],[226,18,226,20],[226,21,226,23],[224,15,224,17],[225,15,225,17],[225,18,225,20],[225,21,225,23],[214,2,215,14],[218,15,218,17],[218,18,218,20],[218,21,218,23],[224,21,224,23],[220,15,220,17],[220,3,220,14],[221,3,221,14],[222,15,222,17],[220,18,220,20],[220,21,220,23],[219,15,219,17],[219,18,219,20],[219,21,219,23],[224,3,224,14],[221,15,221,17],[221,18,221,20],[176,0,176,25],[177,0,179,4],[177,5,179,10],[225,3,225,14],[226,3,226,14],[216,15,216,17],[216,18,216,20],[218,3,218,14],[214,15,214,23],[215,15,215,17],[215,18,215,20],[215,21,215,23],[216,21,216,23],[217,15,217,17],[217,18,217,20],[217,21,217,23],[223,3,223,14],[219,3,219,14],[222,3,222,14],[224,18,224,20],[222,18,222,20],[222,21,222,23],[216,3,216,14],[217,3,217,14]]}
[{"$f":"NCOM&\" (\"&PCOM&\")\"","v":"Comune di Trescore Cremasco (CR)"},null,null,null,null,null,null,{"$f":"IF(INDEX(INT,1,13)=\"\",INDEX(INT,1,1),INDEX(INT,1,13))","v":"Piano di Emergenza Intercomunale di Protezione Civile"},null,null,null,null,null,null,null,null,null,null,null,{"$f":"IF(TIPOP=\"Edizione\",\"Ed. \",IF(TIPOP=\"Revisione\",\"Rev. \",\"Bozza \"))&TIPON&\" del \"&TIPOD","v":"Ed. 01 del 04/11/2012"}]
[]
[]
["Scheda Scenario",null,null,null,null,null,null,null,null,null,null,null,null,null,null,null,null,null,null,null,null,null,null,{"$f":"_RI2","v":"RI.3"}]
[]
[{"$f":"IF(INDEX(RI2PAR,1,19)=\"\",INDEX(RI2PAR,1,12),INDEX(RI2PAR,1,19))&\" - Fase di Allerta Codice 3 \"","v":"Rischio Idrogeologico - Fase di Allerta Codice 3 "}]
[]
[]
[null,"Paragrafi di Riferimento ",null,null,null,null,null,null,null,null,{"$f":"INDEX(RI2PAR,1,1)&INDEX(RI2PAR,1,12)","v":"2.2.1 - 2.2.2 - 3.3.1 Procedure per il Rischio Idrogeologico"}]
[null,"Codice Scheda Procedura UCL",null,null,null,null,null,null,null,null,{"$f":"X4","v":"RI.3"}]
[null,"Evento atteso",null,null,null,null,null,null,null,null,"Scenari di rischio approfonditi nel Piano di Emeregenza e qualsiasi tipologia di dissesto idrogeologico non atteso che si sia verificato o che si stia verificando e che, di conseguenza, non sia stato pianificato nello specifico."]
[]
[]
[]
[null,null,null,null,null,null,null,null,null,null,"Ricezione di avviso di Allerta Meteo per criticità Elevata da Regione Lombardia."]
[]
[null,"Attività U.C.L.",null,null,null,null,null,null,null,null,"Attivazione Servizio di Salvaguardia con finalità di tutela e salvaguardia della popolazione interessata. Rimangono operative, se attivo, le funzioni del Servizio di Allerta, viceversa deve essere attivato (Scheda RI.2)."]
[]
[]
[]
[]
[null,"Ubicazione intervento",null,null,null,null,null,null,null,null,"Aree identificate."]
[]
[null,"Personale mobilitato",null,null,null,null,null,null,null,null,{"$f":"IF(INDEX(RI2PER,1,1)=\"\",\"\",\"- \"&VLOOKUP(INDEX(RI2PER,1,1),Personale,IF(INDEX(Personale,INDEX(RI2PER,1,1),14)=\"\",2,14)))","v":"- Polizia Locale"},null,null,null,null,null,null,"Riportare la composizione delle squadre nel Modulo M1"]
[null,null,null,null,null,null,null,null,null,null,{"$f":"IF(INDEX(RI2PER,1,2)=\"\",\"\",\"- \"&VLOOKUP(INDEX(RI2PER,1,2),Personale,IF(INDEX(Personale,INDEX(RI2PER,1,2),14)=\"\",2,14)))","v":"- Volontari P.C."}]
[null,null,null,null,null,null,null,null,null,null,{"$f":"IF(INDEX(RI2PER,1,3)=\"\",\"\",\"- \"&VLOOKUP(INDEX(RI2PER,1,3),Personale,IF(INDEX(Personale,INDEX(RI2PER,1,3),14)=\"\",2,14)))","v":"- Tecnici/Operai Comunali"}]
[null,"Attività personale mobilitato",null,null,null,null,null,null,null,null,"Attivazione delle aree di raccolta della popolazione e di ricovero ed evacuazione della popolazione interessata. Se non già attivo si rende operativo il Servizio di Allerta."]
[]
[]
[]
[null,"Grado di coinvolgimento della popolazione",null,null,null,null,null,null,null,null,"Dipende dall’ampiezza della zona colpita. Si procede con l’informativa alla popolazione potenzialmente interessata ed alla loro eventuale evacuazione."]
[]
[]
[null,null,null,null,null,null,null,null,null,null,"Registrare le persone eventualmente evacuate nel Modulo M2"]
[null,"Cancelli e vie alternative",null,null,null,null,null,null,null,null,"Vengono posizionati dei cancelli finalizzati alla regolazione del traffico nelle zone interessate."]
[]
[]
[null,"Aree di raccolta popolazione",null,null,null,{"$f":"IF(INDEX(RI2RIC,1,1)=\"\",\"In questa fase non è prevista l’attivazione di tali aree.\",\"Per questa emergenza \"&IF(INDEX(RI2RIC,1,2)=\"\",\"è disponibile la seguente area:\",\"sono disponibili le seguenti aree:\"))","v":"Per questa emergenza sono disponibili le seguenti aree:"}]
[null,null,null,null,null,{"$f":"IF(INDEX(RI2RIC,1,1)=\"\",\"\",\"- \"&VLOOKUP(INDEX(RI2RIC,1,1),Ricovero,2))","v":"- Centro Sportivo Comunale - Carta AE.41 - Trescore Cremasco - Ricovero/Tendopoli"}]
[null,null,null,null,null,{"$f":"IF(INDEX(RI2RIC,1,2)=\"\",\"\",\"- \"&VLOOKUP(INDEX(RI2RIC,1,2),Ricovero,2))","v":"- Scuola Secondaria di I Grado \"Manzoni\" - Carta AE.42 - Trescore Cremasco - Ricovero"}]
[null,null,null,null,null,{"$f":"IF(INDEX(RI2RIC,1,3)=\"\",\"\",\"- \"&VLOOKUP(INDEX(RI2RIC,1,3),Ricovero,2))","v":"- Scuola Primaria Trescore Cremasco - Carta AE.43 - Trescore Cremasco - Ricovero"}]
[null,"Area di ricovero",null,null,null,{"$f":"IF(INDEX(RI2RIC,1,4)=\"\",\"\",\"- \"&VLOOKUP(INDEX(RI2RIC,1,4),Ricovero,2))","v":""}]
[null,null,null,null,null,{"$f":"IF(INDEX(RI2RIC,1,5)=\"\",\"\",\"- \"&VLOOKUP(INDEX(RI2RIC,1,5),Ricovero,2))","v":""}]
[null,null,null,null,null,{"$f":"IF(INDEX(RI2RIC,1,7)=\"\",\"\",\"- \"&VLOOKUP(INDEX(RI2RIC,1,7),Ricovero,2))","v":""}]
[null,null,null,null,null,{"$f":"IF(F41=\"\",\"\",\"In funzione della gravità della situazione si decide quali/quante aree attivare.\")","v":"In funzione della gravità della situazione si decide quali/quante aree attivare."}]
[null,"Area di raduno soccorritori",null,null,null,{"$f":"IF(INDEX(RI2SOC,1,1)=\"\",\"In questa fase non è prevista l’attivazione di tali aree.\",\"Per questa emergenza \"&IF(INDEX(RI2SOC,1,2)=\"\",\"è disponibile la seguente area:\",\"sono disponibili le seguenti aree:\"))","v":"Per questa emergenza sono disponibili le seguenti aree:"}]
[null,null,null,null,null,{"$f":"IF(INDEX(RI2SOC,1,1)=\"\",\"\",\"- \"&VLOOKUP(INDEX(RI2SOC,1,1),Soccorritori,2))","v":"- Centro Sportivo Comunale - Carte AE.41 - Trescore Cremasco - SV.41 - Aviosuperficie"}]
[null,null,null,null,null,{"$f":"IF(INDEX(RI2SOC,1,2)=\"\",\"\",\"- \"&VLOOKUP(INDEX(RI2SOC,1,2),Soccorritori,2))","v":"- Centro Sportivo Comunale - Carte AE.41 - Trescore Cremasco - SV.41 - Ammassamento"}]
[null,null,null,null,null,{"$f":"IF(INDEX(RI2SOC,1,3)=\"\",\"\",\"- \"&VLOOKUP(INDEX(RI2SOC,1,3),Soccorritori,2))","v":""}]
[null,null,null,null,null,{"$f":"IF(F48=\"\",\"\",\"In funzione della gravità della situazione si decide quali/quante aree attivare.\")","v":"In funzione della gravità della situazione si decide quali/quante aree attivare."}]
[null,"Ordinanze Necessarie",null,null,null,null,null,null,null,null,"Ordinanza di Evacuazione;"]
[null,null,null,null,null,null,null,null,null,null,"Ordinanza di Chiusura Strade."]
[null,"Modalita’ Riunione U.C.L.",null,null,null,null,null,null,null,null,null,"Non necessaria"]
[null,null,null,null,null,null,null,null,null,null,null,"Virtuale"]
[null,null,null,null,null,null,null,null,null,null,"X","In sede"]
[null,"Possibili Scenari Concomitanti",null,null,null,null,null,null,null,null,"Non ragionevolmente prevedibile la concomitanza con altri eventi."]
[]
[]
[]
[null,"Contatti Utili",null,null,null,null,null,null,null,null,{"$f":"\"Consultare il \"&IF([1]Maschera!Z71=\"\",[1]Maschera!N71,[1]Maschera!Z71)","v":"Consultare il Tomo Giallo - Risorse"}]
[null,"Cartografia",null,null,null,null,null,null,null,null,{"$f":"INDEX(RI2PAR,1,28)","v":"Tav. 3/A - Rischio Idrogeologico"}]
[null,null,null,null,null,null,null,null,null,null,{"$f":"INDEX(RI2PAR,1,39)","v":"Tav. 3/D - Stradario Piano di Emergenza"}]
[]
[{"$f":"Titolo2","v":"Procedure U.C.L."},null,null,null,null,null,null,null,null,null,null,null,null,null,null,null,null,null,null,null,null,null,null,{"$f":"_RI2","v":"RI.3"}]
[]
[{"$f":"$A$6","v":"Rischio Idrogeologico - Fase di Allerta Codice 3 "}]
[]
[]
[]
[]
[]
[]
[]
[]
[]
[]
[]
[]
[]
[]
[]
[]
[]
[]
[]
[]
[]
[]
[]
[]
[]
[]
[]
[]
[]
[]
[]
[]
[]
[]
[]
[]
[]
[]
[]
[]
[]
[]
[]
[]
[]
[]
[]
[]
[]
[]
[]
[]
[]
[]
[]
[]
[]
[{"$f":"Titolo2","v":"Procedure U.C.L."},null,null,null,null,null,null,null,null,null,null,null,null,null,null,null,null,null,null,null,null,null,null,{"$f":"X4","v":"RI.3"}]
[]
[{"$f":"$A$6","v":"Rischio Idrogeologico - Fase di Allerta Codice 3 "}]
[]
[]
["RESPONSABILE",null,null,null,null,"AZIONE",null,null,null,null,null,"CHIAMATE"]
[null,null,null,null,null,null,null,null,null,null,null,"MEMBRO UCL",null,null,null,"OPERATIVI",null,null,null,"ENTE INTERESSATO",null,null,null,"SCHEDE CHIAMATE"]
[]
[{"$f":"IF(INDEX(Sindaco,1,9)=\"\",INDEX(Sindaco,1,1),INDEX(Sindaco,1,9))","v":"SINDACO / R.O.C."},null,null,null,null,"Avvisa della Fase di Allerta Codice 3 gli enti sovraordinati e attiva l’UCL.",null,null,null,null,null,"- Tutti",null,null,null,"--",null,null,null,{"$f":"\"- \"&IF(INDEX(PR,1,9)=\"\",INDEX(PR,1,1),INDEX(PR,1,9))","v":"- Prefettura"},null,null,null,"O1 - O2"]
[null,null,null,null,null,null,null,null,null,null,null,null,null,null,null,null,null,null,null,{"$f":"\"- \"&IF(INDEX(PRO,1,9)=\"\",INDEX(PRO,1,1),INDEX(PRO,1,9))","v":"- Provincia"},null,null,null,"C2.1","C2.3","C2.4"]
[null,null,null,null,null,null,null,null,null,null,null,null,null,null,null,null,null,null,null,{"$f":"\"- \"&IF(INDEX(REG,1,9)=\"\",INDEX(REG,1,1),INDEX(REG,1,9))","v":"- Regione"}]
[{"$f":"IF(INDEX(ROC,1,9)=\"\",INDEX(ROC,1,1),INDEX(ROC,1,9))","v":"R.O.C."},null,null,null,null,{"$f":"\"Attiva il Servizio di Allerta. \"&_RI1&\".1\"","v":"Attiva il Servizio di Allerta. RI.2.1"},null,null,null,null,null,"--",null,null,null,"--",null,null,null,"--",null,null,null,"O1 - O2"]
["(Codice 3 non preceduto da Codice 2)"]
[]
[{"$f":"IF(INDEX(Sindaco,1,9)=\"\",INDEX(Sindaco,1,1),INDEX(Sindaco,1,9))","v":"SINDACO / R.O.C."},null,null,null,null,"Informa su quanto fatto gli enti sovraordinati.",null,null,null,null,null,"--",null,null,null,"--",null,null,null,{"$f":"\"- \"&IF(INDEX(PR,1,9)=\"\",INDEX(PR,1,1),INDEX(PR,1,9))","v":"- Prefettura"},null,null,null,"C2.1  C2.4"]
[null,null,null,null,null,null,null,null,null,null,null,null,null,null,null,null,null,null,null,{"$f":"\"- \"&IF(INDEX(PRO,1,9)=\"\",INDEX(PRO,1,1),INDEX(PRO,1,9))","v":"- Provincia"}]
[null,null,null,null,null,null,null,null,null,null,null,null,null,null,null,null,null,null,null,{"$f":"\"- \"&IF(INDEX(REG,1,9)=\"\",INDEX(REG,1,1),INDEX(REG,1,9))","v":"- Regione"}]
[]
[{"$f":"IF(INDEX(Sindaco,1,9)=\"\",INDEX(Sindaco,1,1),INDEX(Sindaco,1,9))","v":"SINDACO / R.O.C."},null,null,null,null,{"$f":"\"Se necessario dispone cancelli su strade comunali, statali e/o provinciali e procede con l'informazione alla popolazione delle zone interessate. \"&_RI2&\".1\"","v":"Se necessario dispone cancelli su strade comunali, statali e/o provinciali e procede con l'informazione alla popolazione delle zone interessate. RI.3.1"},null,null,null,null,null,null,null,null,null,"--",null,null,null,null,null,null,null,"O1 - O2  C2.1",null,null,{"$f":"_RI2&\".1\"","v":"RI.3.1"}]
[null,null,null,null,null,null,null,null,null,null,null,{"$f":"\"- \"&PROPER(IF(INDEX(PL,1,9)=\"\",INDEX(PL,1,1),INDEX(PL,1,9)))","v":"- Polizia Locale"}]
[null,null,null,null,null,null,null,null,null,null,null,{"$f":"\"- \"&PROPER(IF(INDEX(CV,1,9)=\"\",INDEX(CV,1,1),INDEX(CV,1,9)))","v":"- C. Volontariato"},null,null,null,null,null,null,null,{"$f":"\"- \"&IF(INDEX(AN,1,9)=\"\",INDEX(AN,1,1),INDEX(AN,1,9))","v":"- ANAS"}]
[null,null,null,null,null,null,null,null,null,null,null,{"$f":"\"- \"&PROPER(IF(INDEX(CC,1,9)=\"\",INDEX(CC,1,1),INDEX(CC,1,9)))","v":"- C. Carabinieri"},null,null,null,null,null,null,null,{"$f":"\"- \"&IF(INDEX(PRO,1,9)=\"\",INDEX(PRO,1,1),INDEX(PRO,1,9))","v":"- Provincia"}]
[]
[]
[{"$f":"IF(INDEX(PL,1,9)=\"\",INDEX(PL,1,1),INDEX(PL,1,9))","v":"POLIZIA LOCALE"},null,null,null,null,{"$f":"\"Responsabile \"&_RI2&\".1\"","v":"Responsabile RI.3.1"},null,null,null,null,null,{"$f":"\"- \"&PROPER(IF(INDEX(CV,1,9)=\"\",INDEX(CV,1,1),INDEX(CV,1,9)))","v":"- C. Volontariato"},null,null,null,{"$f":"\"- \"&IF(INDEX(PLO,1,9)=\"\",INDEX(PLO,1,1),INDEX(PLO,1,9))","v":"- Agenti P.L."},null,null,null,"--",null,null,null,"O1 - O2  A2.2"]
[null,null,null,null,null,null,null,null,null,null,null,{"$f":"\"- \"&PROPER(IF(INDEX(CC,1,9)=\"\",INDEX(CC,1,1),INDEX(CC,1,9)))","v":"- C. Carabinieri"}]
[{"$f":"IF(INDEX(CV,1,9)=\"\",INDEX(CV,1,1),INDEX(CV,1,9))","v":"C. VOLONTARIATO"},null,null,null,null,{"$f":"\"Coadiuva \"&_RI2&\".1\"","v":"Coadiuva RI.3.1"},null,null,null,null,null,"--",null,null,null,{"$f":"\"- \"&IF(INDEX(VO,1,9)=\"\",INDEX(VO,1,1),INDEX(VO,1,9))","v":"- Gruppi Volontari"},null,null,null,"--",null,null,null,"A3 - B3"]
[{"$f":"IF(INDEX(CC,1,9)=\"\",INDEX(CC,1,1),INDEX(CC,1,9))","v":"C. CARABINIERI"},null,null,null,null,{"$f":"\"Coadiuva \"&_RI2&\".1\"","v":"Coadiuva RI.3.1"},null,null,null,null,null,"--",null,null,null,{"$f":"\"- \"&IF(INDEX(CO,1,9)=\"\",INDEX(CO,1,1),INDEX(CO,1,9))","v":"- Carabinieri"},null,null,null,"--",null,null,null,"--"]
[{"$f":"IF(INDEX(Sindaco,1,9)=\"\",INDEX(Sindaco,1,1),INDEX(Sindaco,1,9))","v":"SINDACO / R.O.C."},null,null,null,null,{"$f":"\"Se necessario attiva le aree di emergenza \"&_RI2&\".2\"","v":"Se necessario attiva le aree di emergenza RI.3.2"},null,null,null,null,null,{"$f":"\"- \"&PROPER(IF(INDEX(RT,1,9)=\"\",INDEX(RT,1,1),INDEX(RT,1,9)))","v":"- Resp. Territorio"},null,null,null,"--",null,null,null,"--",null,null,null,"O1 - O2"]
[null,null,null,null,null,null,null,null,null,null,null,{"$f":"\"- \"&PROPER(IF(INDEX(CV,1,9)=\"\",INDEX(CV,1,1),INDEX(CV,1,9)))","v":"- C. Volontariato"}]
[null,null,null,null,null,null,null,null,null,null,null,{"$f":"\"- \"&PROPER(IF(INDEX(RSS,1,9)=\"\",INDEX(RSS,1,1),INDEX(RSS,1,9)))","v":"- Resp. Serv. Sociali"}]
[{"$f":"IF(INDEX(RT,1,9)=\"\",INDEX(RT,1,1),INDEX(RT,1,9))","v":"RESP. TERRITORIO"},null,null,null,null,{"$f":"\"Responsabile \"&_RI2&\".2\"","v":"Responsabile RI.3.2"},null,null,null,null,null,null,null,null,null,{"$f":"\"- \"&IF(INDEX(TCO,1,9)=\"\",INDEX(TCO,1,1),INDEX(TCO,1,9))","v":"- Tecnici Comunali"},null,null,null,"--",null,null,null,"O1 - O2",null,"A2.1",{"$f":"_RI2&\".2\"","v":"RI.3.2"}]
[null,null,null,null,null,null,null,null,null,null,null,{"$f":"\"- \"&PROPER(IF(INDEX(CV,1,9)=\"\",INDEX(CV,1,1),INDEX(CV,1,9)))","v":"- C. Volontariato"},null,null,null,null,null,null,null,null,null,null,null,"A4","A5","A6"]
[null,null,null,null,null,null,null,null,null,null,null,{"$f":"\"- \"&PROPER(IF(INDEX(RSS,1,9)=\"\",INDEX(RSS,1,1),INDEX(RSS,1,9)))","v":"- Resp. Serv. Sociali"},null,null,null,null,null,null,null,null,null,null,null,"A7.1","A7.2","B5"]
[null,null,null,null,null,null,null,null,null,null,null,null,null,null,null,null,null,null,null,null,null,null,null,"B6","C1"]
[{"$f":"IF(INDEX(CV,1,9)=\"\",INDEX(CV,1,1),INDEX(CV,1,9))","v":"C. VOLONTARIATO"},null,null,null,null,{"$f":"\"Coadiuva \"&_RI2&\".2\"","v":"Coadiuva RI.3.2"},null,null,null,null,null,"--",null,null,null,{"$f":"\"- \"&IF(INDEX(VO,1,9)=\"\",INDEX(VO,1,1),INDEX(VO,1,9))","v":"- Gruppi Volontari"},null,null,null,"--",null,null,null,"A3 - B3"]
[{"$f":"IF(INDEX(RSS,1,9)=\"\",INDEX(RSS,1,1),INDEX(RSS,1,9))","v":"RESP. SERV. SOCIALI"},null,null,null,null,{"$f":"\"Coadiuva \"&_RI2&\".2\"","v":"Coadiuva RI.3.2"},null,null,null,null,null,"--",null,null,null,{"$f":"\"- \"&IF(INDEX(SO,1,9)=\"\",INDEX(SO,1,1),INDEX(SO,1,9))","v":"- Pers. Sanitario"},null,null,null,"--",null,null,null,"B1 - C2.2 ",null,"D1"]
[{"$f":"IF(INDEX(Sindaco,1,9)=\"\",INDEX(Sindaco,1,1),INDEX(Sindaco,1,9))","v":"SINDACO / R.O.C."},null,null,null,null,{"$f":"\"Se necessario ordina evacuazioni. \"&_RI2&\".3\"","v":"Se necessario ordina evacuazioni. RI.3.3"},null,null,null,null,null,{"$f":"\"- \"&PROPER(IF(INDEX(PL,1,9)=\"\",INDEX(PL,1,1),INDEX(PL,1,9)))","v":"- Polizia Locale"},null,null,null,"--",null,null,null,"--",null,null,null,"O1 - O2",null,null,{"$f":"_RI2&\".3\"","v":"RI.3.3"}]
[null,null,null,null,null,null,null,null,null,null,null,{"$f":"\"- \"&PROPER(IF(INDEX(CV,1,9)=\"\",INDEX(CV,1,1),INDEX(CV,1,9)))","v":"- C. Volontariato"}]
[null,null,null,null,null,null,null,null,null,null,null,{"$f":"\"- \"&PROPER(IF(INDEX(CC,1,9)=\"\",INDEX(CC,1,1),INDEX(CC,1,9)))","v":"- C. Carabinieri"}]
[{"$f":"IF(INDEX(PL,1,9)=\"\",INDEX(PL,1,1),INDEX(PL,1,9))","v":"POLIZIA LOCALE"},null,null,null,null,{"$f":"\"Responsabile \"&_RI2&\".3\"","v":"Responsabile RI.3.3"},null,null,null,null,null,{"$f":"\"- \"&PROPER(IF(INDEX(CV,1,9)=\"\",INDEX(CV,1,1),INDEX(CV,1,9)))","v":"- C. Volontariato"},null,null,null,{"$f":"\"- \"&IF(INDEX(PLO,1,9)=\"\",INDEX(PLO,1,1),INDEX(PLO,1,9))","v":"- Agenti P.L."},null,null,null,"--",null,null,null,"O1 - O2  A2.2"]
[null,null,null,null,null,null,null,null,null,null,null,{"$f":"\"- \"&PROPER(IF(INDEX(CC,1,9)=\"\",INDEX(CC,1,1),INDEX(CC,1,9)))","v":"- C. Carabinieri"},null,null,null,null,null,null,null,null,null,null,null,"M2","D2"]
[{"$f":"IF(INDEX(CV,1,9)=\"\",INDEX(CV,1,1),INDEX(CV,1,9))","v":"C. VOLONTARIATO"},null,null,null,null,{"$f":"\"Coadiuva \"&_RI2&\".3\"","v":"Coadiuva RI.3.3"},null,null,null,null,null,"--",null,null,null,{"$f":"\"- \"&IF(INDEX(VO,1,9)=\"\",INDEX(VO,1,1),INDEX(VO,1,9))","v":"- Gruppi Volontari"},null,null,null,"--",null,null,null,"A3 - B3"]
[{"$f":"IF(INDEX(CC,1,9)=\"\",INDEX(CC,1,1),INDEX(CC,1,9))","v":"C. CARABINIERI"},null,null,null,null,{"$f":"\"Coadiuva \"&_RI2&\".3\"","v":"Coadiuva RI.3.3"},null,null,null,null,null,"--",null,null,null,{"$f":"\"- \"&IF(INDEX(CO,1,9)=\"\",INDEX(CO,1,1),INDEX(CO,1,9))","v":"- Carabinieri"},null,null,null,"--",null,null,null,"--"]
[{"$f":"IF(INDEX(Sindaco,1,9)=\"\",INDEX(Sindaco,1,1),INDEX(Sindaco,1,9))","v":"SINDACO / R.O.C."},null,null,null,null,"Informa periodicamente gli enti sovraordinati e i media su quanto fatto.",null,null,null,null,null,"--",null,null,null,"--",null,null,null,{"$f":"\"- \"&IF(INDEX(PR,1,9)=\"\",INDEX(PR,1,1),INDEX(PR,1,9))","v":"- Prefettura"},null,null,null,"C2.1  C2.3  C2.4"]
[null,null,null,null,null,null,null,null,null,null,null,null,null,null,null,null,null,null,null,{"$f":"\"- \"&IF(INDEX(PRO,1,9)=\"\",INDEX(PRO,1,1),INDEX(PRO,1,9))","v":"- Provincia"}]
[null,null,null,null,null,null,null,null,null,null,null,null,null,null,null,null,null,null,null,{"$f":"\"- \"&IF(INDEX(REG,1,9)=\"\",INDEX(REG,1,1),INDEX(REG,1,9))","v":"- Regione"}]
[]
["SE L’EVENTO EVOLVE VERSO UNA SITUAZIONE DI PERICOLO IMMINENTE"]
[{"$f":"IF(INDEX(Sindaco,1,9)=\"\",INDEX(Sindaco,1,1),INDEX(Sindaco,1,9))","v":"SINDACO / R.O.C."},null,null,null,null,"Dichira lo stato di Allerta Codice 4.",null,null,null,null,null,"- Tutti",null,null,null,"--",null,null,null,{"$f":"\"- \"&IF(INDEX(PR,1,9)=\"\",INDEX(PR,1,1),INDEX(PR,1,9))","v":"- Prefettura"}]
[null,null,null,null,null,null,null,null,null,null,null,null,null,null,null,null,null,null,null,{"$f":"\"- \"&IF(INDEX(PRO,1,9)=\"\",INDEX(PRO,1,1),INDEX(PRO,1,9))","v":"- Provincia"},null,null,null,"O1 - O2"]
[null,null,null,null,null,null,null,null,null,null,null,null,null,null,null,null,null,null,null,{"$f":"\"- \"&IF(INDEX(REG,1,9)=\"\",INDEX(REG,1,1),INDEX(REG,1,9))","v":"- Regione"},null,null,null,"C2.1","C2.3","C2.4"]
[]
["SE VIENE COMUNICATO LA CESSATA ALLERTA CODICE 3"]
[{"$f":"IF(INDEX(Sindaco,1,9)=\"\",INDEX(Sindaco,1,1),INDEX(Sindaco,1,9))","v":"SINDACO / R.O.C."},null,null,null,null,"Informa i media della Cessata Allerta Codice 3 e dispone il rientro della popolazione.",null,null,null,null,null,"- Tutti",null,null,null,"--",null,null,null,"--",null,null,null,"O1 - O2  C2.3"]
[null,null,null,null,null,null,null,null,null,null,null,null,null,null,null,null,null,null,null,null,null,null,null,"M1","M2"]
[]
[]
["PER LE COMUNICAZIONI EVIDENZIATE IN ROSSO UTILIZZARE IL MODULO FAX M4"]
[]
[{"$f":"Titolo3","v":"Scheda Procedura Operativa"},null,null,null,null,null,null,null,null,null,null,null,null,null,null,null,null,null,null,null,null,null,null,{"$f":"X4","v":"RI.3"}]
[]
[{"$f":"$A$6","v":"Rischio Idrogeologico - Fase di Allerta Codice 3 "}]
[]
[]
[null,"Codice Scheda Scenario",null,null,null,null,null,{"$f":"X4","v":"RI.3"}]
[null,"Tipo di Procedure",null,null,null,null,null,{"$f":"_RI2&\".1 \"&_RI2&\".2 \"&_RI2&\".3 - SERVIZIO DI SALVAGUARDIA\"","v":"RI.3.1 RI.3.2 RI.3.3 - SERVIZIO DI SALVAGUARDIA"}]
[null,"Ubicazione intervento",null,null,null,null,null,"Non prevedibile a priori"]
[null,"Aree di raccolta popolazione",null,null,null,null,null,{"$f":"IF(INDEX(RI2RIC,1,1)=\"\",\"In questa fase non è prevista l’attivazione di tali aree.\",\"Per questa emergenza \"&IF(INDEX(RI2RIC,1,2)=\"\",\"è disponibile la seguente area:\",\"sono disponibili le seguenti aree:\"))","v":"Per questa emergenza sono disponibili le seguenti aree:"}]
[null,null,null,null,null,null,null,{"$f":"IF(INDEX(RI2RIC,1,1)=\"\",\"\",\"- \"&VLOOKUP(INDEX(RI2RIC,1,1),Ricovero,2))","v":"- Centro Sportivo Comunale - Carta AE.41 - Trescore Cremasco - Ricovero/Tendopoli"}]
[null,null,null,null,null,null,null,{"$f":"IF(INDEX(RI2RIC,1,2)=\"\",\"\",\"- \"&VLOOKUP(INDEX(RI2RIC,1,2),Ricovero,2))","v":"- Scuola Secondaria di I Grado \"Manzoni\" - Carta AE.42 - Trescore Cremasco - Ricovero"}]
[null,null,null,null,null,null,null,{"$f":"IF(INDEX(RI2RIC,1,3)=\"\",\"\",\"- \"&VLOOKUP(INDEX(RI2RIC,1,3),Ricovero,2))","v":"- Scuola Primaria Trescore Cremasco - Carta AE.43 - Trescore Cremasco - Ricovero"}]
[null,"Aree di ricovero",null,null,null,null,null,{"$f":"IF(INDEX(RI2RIC,1,4)=\"\",\"\",\"- \"&VLOOKUP(INDEX(RI2RIC,1,4),Ricovero,2))","v":""}]
[null,null,null,null,null,null,null,{"$f":"IF(INDEX(RI2RIC,1,5)=\"\",\"\",\"- \"&VLOOKUP(INDEX(RI2RIC,1,5),Ricovero,2))","v":""}]
[null,null,null,null,null,null,null,{"$f":"IF(INDEX(RI2RIC,1,6)=\"\",\"\",\"- \"&VLOOKUP(INDEX(RI2RIC,1,6),Ricovero,2))","v":""}]
[null,null,null,null,null,null,null,{"$f":"IF(INDEX(RI2RIC,1,7)=\"\",\"\",\"- \"&VLOOKUP(INDEX(RI2RIC,1,7),Ricovero,2))","v":""}]
[null,null,null,null,null,null,null,{"$f":"IF(H194=\"\",\"\",\"In funzione della gravità della situazione si decide quali/quante aree attivare.\")","v":"In funzione della gravità della situazione si decide quali/quante aree attivare."}]
[null,"Aree di raduno soccorritori",null,null,null,null,null,{"$f":"IF(INDEX(RI2SOC,1,1)=\"\",\"In questa fase non è prevista l’attivazione di tali aree.\",\"Per questa emergenza \"&IF(INDEX(RI2SOC,1,2)=\"\",\"è disponibile la seguente area:\",\"sono disponibili le seguenti aree:\"))","v":"Per questa emergenza sono disponibili le seguenti aree:"}]
[null,null,null,null,null,null,null,{"$f":"IF(INDEX(RI2SOC,1,1)=\"\",\"\",\"- \"&VLOOKUP(INDEX(RI2SOC,1,1),Soccorritori,2))","v":"- Centro Sportivo Comunale - Carte AE.41 - Trescore Cremasco - SV.41 - Aviosuperficie"}]
[null,null,null,null,null,null,null,{"$f":"IF(INDEX(RI2SOC,1,2)=\"\",\"\",\"- \"&VLOOKUP(INDEX(RI2SOC,1,2),Soccorritori,2))","v":"- Centro Sportivo Comunale - Carte AE.41 - Trescore Cremasco - SV.41 - Ammassamento"}]
[null,null,null,null,null,null,null,{"$f":"IF(INDEX(RI2SOC,1,3)=\"\",\"\",\"- \"&VLOOKUP(INDEX(RI2SOC,1,3),Soccorritori,2))","v":""}]
[null,null,null,null,null,null,null,{"$f":"IF(H203=\"\",\"\",\"In funzione della gravità della situazione si decide quali/quante aree attivare.\")","v":"In funzione della gravità della situazione si decide quali/quante aree attivare."}]
[null,"Cancelli e vie alternative",null,null,null,null,null,"I cancelli di regolazione del traffico vengono posizionati in funzione della estensione dell'evento."]
[]
[null,"Contatti Utili",null,null,null,null,null,"Si faccia riferimento al PRONTUARIO DI EMERGENZA - CONTATTI"]
[]
[]
[]
[]
[]
[]
[null,null,"Procedura Operativa Standard (POS)",null,null,null,null,null,null,null,null,null,null,null,null,"Procedure Previste"]
[null,null,null,null,null,null,null,null,null,null,null,null,null,null,null,{"$f":"MID(H190,1,6)","v":"RI.3.1"},null,null,{"$f":"MID(H190,8,6)","v":"RI.3.2"},null,null,{"$f":"MID(H190,15,6)","v":"RI.3.3"}]
[null,null,1,"Monitoraggio",null,null,null,null,null,null,null,null,null,null,null,"--",null,null,"--",null,null,"--"]
[null,null,2,"Perlustrazione",null,null,null,null,null,null,null,null,null,null,null,"--",null,null,"--",null,null,"--"]
[null,null,3,"Presidio Cancelli/Supporto Viabilità",null,null,null,null,null,null,null,null,null,null,null,"X",null,null,"--",null,null,"--"]
[null,null,4,"Informazione Diretta alla Popolazione",null,null,null,null,null,null,null,null,null,null,null,"X",null,null,"--",null,null,"--"]
[null,null,5,"Allestimento Area di Ricovero",null,null,null,null,null,null,null,null,null,null,null,"--",null,null,"X",null,null,"--"]
[null,null,6,"Allestimento Area di Ammassamento Soccorsi",null,null,null,null,null,null,null,null,null,null,null,"--",null,null,"--",null,null,"--"]
[null,null,7,"Evacuazione",null,null,null,null,null,null,null,null,null,null,null,"--",null,null,"--",null,null,"X"]
[null,null,8,"Rimozione Ostacoli",null,null,null,null,null,null,null,null,null,null,null,"--",null,null,"--",null,null,"--"]
[null,null,9,"Rimozione Ostacoli da Alveo",null,null,null,null,null,null,null,null,null,null,null,"--",null,null,"--",null,null,"--"]
[null,null,10,"Preservazione Argini",null,null,null,null,null,null,null,null,null,null,null,"--",null,null,"--",null,null,"--"]
[null,null,11,"Frana",null,null,null,null,null,null,null,null,null,null,null,"--",null,null,"--",null,null,"--"]

{"sheet":"RI_4","index":3,"n_rows":227,"n_cols":27,"rows_kept":227,"cut":false,"hidden":false,"merged":[[40,1,43,4],[44,1,48,4],[36,5,36,24],[37,5,37,24],[38,5,38,24],[39,5,39,24],[40,5,40,24],[41,5,41,24],[42,5,42,24],[43,5,43,24],[44,5,44,24],[45,5,45,24],[46,5,46,24],[47,5,47,24],[48,5,48,24],[23,10,23,16],[22,10,22,16],[21,10,21,16],[21,17,23,24],[205,1,206,6],[205,7,206,24],[207,1,209,6],[207,7,209,24],[195,1,199,6],[195,7,195,24],[196,7,196,24],[197,7,197,24],[198,7,198,24],[199,7,199,24],[200,1,204,6],[200,7,200,24],[201,7,201,24],[202,7,202,24],[203,7,203,24],[204,7,204,24],[188,1,188,6],[188,7,188,24],[189,1,189,6],[36,1,39,4],[151,23,154,25],[151,5,153,10],[151,11,154,14],[151,15,154,18],[151,19,154,22],[160,23,160,25],[163,0,164,4],[163,5,166,10],[163,11,166,14],[163,15,166,18],[165,0,166,4],[165,19,165,22],[166,19,166,22],[219,16,219,19],[219,20,219,23],[220,16,220,19],[222,20,222,23],[149,19,149,22],[144,0,146,25],[147,0,150,4],[147,5,150,10],[147,11,147,14],[147,15,150,18],[147,19,147,22],[148,11,148,14],[154,5,154,10],[155,0,157,4],[155,5,157,10],[151,0,154,4],[189,7,189,24],[190,1,190,6],[190,7,190,24],[191,1,194,6],[191,7,191,24],[192,7,192,24],[193,7,193,24],[194,7,194,24],[148,19,148,22],[149,11,149,14],[0,0,1,6],[0,7,1,18],[0,19,1,25],[3,0,4,22],[3,23,6,25],[5,0,6,22],[8,1,8,9],[8,10,8,24],[10,1,13,9],[10,10,13,24],[14,1,18,9],[14,10,18,24],[19,1,20,9],[19,10,20,24],[21,1,23,9],[24,1,27,9],[24,10,27,24],[28,1,31,9],[9,1,9,9],[132,23,132,25],[148,23,148,25],[32,10,35,24],[9,10,9,24],[28,10,31,24],[32,1,35,9],[129,19,130,22],[129,23,130,25],[49,1,50,9],[49,10,49,24],[50,10,50,24],[54,1,58,9],[54,10,58,24],[59,1,59,9],[59,10,59,24],[123,0,124,22],[123,23,126,25],[125,0,126,22],[128,0,130,4],[128,5,130,10],[53,11,53,24],[51,1,53,9],[51,11,51,24],[52,11,52,24],[60,1,61,9],[60,10,60,24],[61,10,61,24],[63,0,64,22],[63,23,66,25],[143,11,143,14],[143,15,143,18],[143,19,143,22],[131,0,131,4],[131,5,134,10],[131,11,134,14],[131,15,134,18],[131,19,131,22],[132,0,134,4],[132,19,132,22],[133,19,133,22],[134,19,134,22],[65,0,66,22],[128,11,128,25],[129,11,130,14],[129,15,130,18],[135,26,143,26],[136,11,136,14],[139,0,142,4],[139,5,142,10],[139,15,142,18],[139,19,142,22],[140,11,140,14],[141,11,141,14],[143,0,143,4],[143,23,143,25],[139,23,139,24],[140,23,141,25],[135,0,138,4],[135,5,138,10],[135,15,138,18],[135,19,138,22],[135,23,138,25],[143,5,143,10],[155,26,157,26],[157,11,157,14],[158,0,158,25],[159,0,162,4],[159,5,162,10],[159,11,162,14],[159,15,162,18],[159,19,159,22],[160,19,160,22],[155,15,157,18],[155,19,157,22],[155,23,157,25],[161,19,161,22],[162,19,162,22],[167,0,167,25],[168,0,171,4],[168,5,171,10],[168,11,171,14],[168,15,171,18],[164,19,164,22],[163,19,163,22],[168,19,168,22],[172,19,175,22],[171,19,171,22],[169,19,169,22],[170,19,170,22],[163,23,163,25],[226,16,226,19],[226,20,226,23],[183,0,184,22],[183,23,186,25],[185,0,186,22],[222,3,222,15],[223,3,223,15],[224,3,224,15],[225,3,225,15],[226,3,226,15],[214,2,215,15],[214,16,214,23],[225,16,225,19],[225,20,225,23],[222,16,222,19],[216,3,216,15],[217,3,217,15],[223,20,223,23],[223,16,223,19],[220,20,220,23],[221,16,221,19],[221,20,221,23],[218,16,218,19],[218,20,218,23],[215,20,215,23],[172,26,179,26],[173,11,173,14],[174,11,174,14],[177,11,177,14],[173,23,173,24],[176,23,176,24],[177,23,178,25],[181,0,181,25],[224,16,224,19],[224,20,224,23],[176,0,178,4],[176,5,178,10],[179,15,179,18],[172,5,175,10],[172,15,175,18],[172,0,175,4],[179,19,179,22],[179,23,179,25],[179,0,179,4],[179,5,179,10],[179,11,179,14],[176,15,178,18],[176,19,178,22],[218,3,218,15],[219,3,219,15],[220,3,220,15],[221,3,221,15],[216,16,216,19],[216,20,216,23],[217,20,217,23],[217,16,217,19],[215,16,215,19]]}
[{"$f":"NCOM&\" (\"&PCOM&\")\"","v":"Comune di Trescore Cremasco (CR)"},null,null,null,null,null,null,{"$f":"IF(INDEX(INT,1,13)=\"\",INDEX(INT,1,1),INDEX(INT,1,13))","v":"Piano di Emergenza Intercomunale di Protezione Civile"},null,null,null,null,null,null,null,null,null,null,null,{"$f":"IF(TIPOP=\"Edizione\",\"Ed. \",IF(TIPOP=\"Revisione\",\"Rev. \",\"Bozza \"))&TIPON&\" del \"&TIPOD","v":"Ed. 01 del 04/11/2012"}]
[]
[]
["Scheda Scenario",null,null,null,null,null,null,null,null,null,null,null,null,null,null,null,null,null,null,null,null,null,null,{"$f":"_RI3","v":"RI.4"}]
[]
[{"$f":"IF(INDEX(RI3PAR,1,19)=\"\",INDEX(RI3PAR,1,12),INDEX(RI3PAR,1,19))&\" - Fase di Allerta Codice 4\"","v":"Rischio Idrogeologico - Fase di Allerta Codice 4"}]
[]
[]
[null,"Paragrafi di Riferimento ",null,null,null,null,null,null,null,null,{"$f":"INDEX(RI3PAR,1,1)&INDEX(RI3PAR,1,12)","v":"2.2.1 - 2.2.2 - 3.3.1 Procedure per il Rischio Idrogeologico"}]
[null,"Codice Scheda Procedura UCL",null,null,null,null,null,null,null,null,{"$f":"X4","v":"RI.4"}]
[null,"Evento atteso",null,null,null,null,null,null,null,null,"Qualsiasi tipologia di dissesto idrogeologico, non atteso e non pianificato nello specifico, che stia causando danni sul territorio.  "]
[]
[]
[]
[null,"Attività U.C.L.",null,null,null,null,null,null,null,null,"Attivazione Servizio di Soccorso che ha la finalità di soccorrere ed allontanare la popolazione interessata dalle zone colpite. Se attivi rimangono operative le funzioni del Servizio di Salvaguardia ed Allerta, viceversa devono essere attivati (Schede RI.2 - RI.3)."]
[]
[]
[]
[]
[null,"Ubicazione intervento",null,null,null,null,null,null,null,null,"Aree identificate."]
[]
[null,"Personale mobilitato",null,null,null,null,null,null,null,null,{"$f":"IF(INDEX(RI2PER,1,1)=\"\",\"\",\"- \"&VLOOKUP(INDEX(RI2PER,1,1),Personale,IF(INDEX(Personale,INDEX(RI2PER,1,1),14)=\"\",2,14)))","v":"- Polizia Locale"},null,null,null,null,null,null,"Riportare la composizione delle squadre nel Modulo M1"]
[null,null,null,null,null,null,null,null,null,null,{"$f":"IF(INDEX(RI2PER,1,2)=\"\",\"\",\"- \"&VLOOKUP(INDEX(RI2PER,1,2),Personale,IF(INDEX(Personale,INDEX(RI2PER,1,2),14)=\"\",2,14)))","v":"- Volontari P.C."}]
[null,null,null,null,null,null,null,null,null,null,{"$f":"IF(INDEX(RI2PER,1,3)=\"\",\"\",\"- \"&VLOOKUP(INDEX(RI2PER,1,3),Personale,IF(INDEX(Personale,INDEX(RI2PER,1,3),14)=\"\",2,14)))","v":"- Tecnici/Operai Comunali"}]
[null,"Attività personale mobilitato",null,null,null,null,null,null,null,null,"Soccorso della popolazione colpita. Se non già attivo si rende operativo il Servizio di Allerta e quello di Salvaguardia. "]
[]
[]
[]
[null,"Grado di coinvolgimento della popolazione",null,null,null,null,null,null,null,null,"Dipende dall'ampiezza della zona colpita. Si procede con il soccorso alla popolazione potenzialmente interessata e si evacuano le persone che si trovano in zone pericolose."]
[]
[]
[]
[null,"Cancelli e vie alternative",null,null,null,null,null,null,null,null,"Vengono posizionati dei cancelli finalizzati alla regolazione del traffico nelle zone interessate. Se già posizionati vengono adeguati in funzione dell'evento."]
[]
[]
[]
[null,"Aree di raccolta popolazione",null,null,null,{"$f":"IF(INDEX(RI2RIC,1,1)=\"\",\"In questa fase non è prevista l’attivazione di tali aree.\",\"Per questa emergenza \"&IF(INDEX(RI2RIC,1,2)=\"\",\"è disponibile la seguente area:\",\"sono disponibili le seguenti aree:\"))","v":"Per questa emergenza sono disponibili le seguenti aree:"}]
[null,null,null,null,null,{"$f":"IF(INDEX(RI2RIC,1,1)=\"\",\"\",\"- \"&VLOOKUP(INDEX(RI2RIC,1,1),Ricovero,2))","v":"- Centro Sportivo Comunale - Carta AE.41 - Trescore Cremasco - Ricovero/Tendopoli"}]
[null,null,null,null,null,{"$f":"IF(INDEX(RI2RIC,1,2)=\"\",\"\",\"- \"&VLOOKUP(INDEX(RI2RIC,1,2),Ricovero,2))","v":"- Scuola Secondaria di I Grado \"Manzoni\" - Carta AE.42 - Trescore Cremasco - Ricovero"}]
[null,null,null,null,null,{"$f":"IF(INDEX(RI2RIC,1,3)=\"\",\"\",\"- \"&VLOOKUP(INDEX(RI2RIC,1,3),Ricovero,2))","v":"- Scuola Primaria Trescore Cremasco - Carta AE.43 - Trescore Cremasco - Ricovero"}]
[null,"Area di ricovero",null,null,null,{"$f":"IF(INDEX(RI2RIC,1,4)=\"\",\"\",\"- \"&VLOOKUP(INDEX(RI2RIC,1,4),Ricovero,2))","v":""}]
[null,null,null,null,null,{"$f":"IF(INDEX(RI2RIC,1,5)=\"\",\"\",\"- \"&VLOOKUP(INDEX(RI2RIC,1,5),Ricovero,2))","v":""}]
[null,null,null,null,null,{"$f":"IF(INDEX(RI2RIC,1,6)=\"\",\"\",\"- \"&VLOOKUP(INDEX(RI2RIC,1,6),Ricovero,2))","v":""}]
[null,null,null,null,null,{"$f":"IF(F39=\"\",\"\",\"In funzione della gravità della situazione si decide quali/quante aree attivare.\")","v":"In funzione della gravità della situazione si decide quali/quante aree attivare."}]
[null,"Area di raduno soccorritori",null,null,null,{"$f":"IF(INDEX(RI2SOC,1,1)=\"\",\"In questa fase non è prevista l’attivazione di tali aree.\",\"Per questa emergenza \"&IF(INDEX(RI2SOC,1,2)=\"\",\"è disponibile la seguente area:\",\"sono disponibili le seguenti aree:\"))","v":"Per questa emergenza sono disponibili le seguenti aree:"}]
[null,null,null,null,null,{"$f":"IF(INDEX(RI2SOC,1,1)=\"\",\"\",\"- \"&VLOOKUP(INDEX(RI2SOC,1,1),Soccorritori,2))","v":"- Centro Sportivo Comunale - Carte AE.41 - Trescore Cremasco - SV.41 - Aviosuperficie"}]
[null,null,null,null,null,{"$f":"IF(INDEX(RI2SOC,1,2)=\"\",\"\",\"- \"&VLOOKUP(INDEX(RI2SOC,1,2),Soccorritori,2))","v":"- Centro Sportivo Comunale - Carte AE.41 - Trescore Cremasco - SV.41 - Ammassamento"}]
[null,null,null,null,null,{"$f":"IF(INDEX(RI2SOC,1,3)=\"\",\"\",\"- \"&VLOOKUP(INDEX(RI2SOC,1,3),Soccorritori,2))","v":""}]
[null,null,null,null,null,{"$f":"IF(F47=\"\",\"\",\"In funzione della gravità della situazione si decide quali/quante aree attivare.\")","v":"In funzione della gravità della situazione si decide quali/quante aree attivare."}]
[null,"Ordinanze Necessarie",null,null,null,null,null,null,null,null,"Ordinanza di Evacuazione;"]
[null,null,null,null,null,null,null,null,null,null,"Ordinanza di Chiusura Strade."]
[null,"Modalita’ Riunione U.C.L.",null,null,null,null,null,null,null,null,null,"Non necessaria"]
[null,null,null,null,null,null,null,null,null,null,null,"Virtuale"]
[null,null,null,null,null,null,null,null,null,null,"X","In sede"]
[null,"Possibili Scenari Concomitanti",null,null,null,null,null,null,null,null,"Non ragionevolmente prevedibile la concomitanza con altri eventi."]
[]
[]
[]
[]
[null,"Contatti Utili",null,null,null,null,null,null,null,null,{"$f":"\"Consultare il \"&IF([1]Maschera!Z71=\"\",[1]Maschera!N71,[1]Maschera!Z71)","v":"Consultare il Tomo Giallo - Risorse"}]
[null,"Cartografia",null,null,null,null,null,null,null,null,{"$f":"INDEX(RI3PAR,1,28)","v":"Tav. 3/A - Rischio Idrogeologico"}]
[null,null,null,null,null,null,null,null,null,null,{"$f":"INDEX(RI3PAR,1,39)","v":"Tav. 3/D - Stradario Piano di Emergenza"}]
[]
[{"$f":"Titolo2","v":"Procedure U.C.L."},null,null,null,null,null,null,null,null,null,null,null,null,null,null,null,null,null,null,null,null,null,null,{"$f":"_RI3","v":"RI.4"}]
[]
[{"$f":"$A$6","v":"Rischio Idrogeologico - Fase di Allerta Codice 4"}]
[]
[]
[]
[]
[]
[]
[]
[]
[]
[]
[]
[]
[]
[]
[]
[]
[]
[]
[]
[]
[]
[]
[]
[]
[]
[]
[]
[]
[]
[]
[]
[]
[]
[]
[]
[]
[]
[]
[]
[]
[]
[]
[]
[]
[]
[]
[]
[]
[]
[]
[]
[]
[]
[]
[]
[]
[]
[{"$f":"Titolo2","v":"Procedure U.C.L."},null,null,null,null,null,null,null,null,null,null,null,null,null,null,null,null,null,null,null,null,null,null,{"$f":"X4","v":"RI.4"}]
[]
[{"$f":"$A$6","v":"Rischio Idrogeologico - Fase di Allerta Codice 4"}]
[]
[]
["RESPONSABILE",null,null,null,null,"AZIONE",null,null,null,null,null,"CHIAMATE"]
[null,null,null,null,null,null,null,null,null,null,null,"MEMBRO UCL",null,null,null,"OPERATIVI",null,null,null,"ENTE INTERESSATO",null,null,null,"SCHEDE CHIAMATE"]
[]
[{"$f":"IF(INDEX(Sindaco,1,9)=\"\",INDEX(Sindaco,1,1),INDEX(Sindaco,1,9))","v":"SINDACO / R.O.C."},null,null,null,null,{"$f":"\"Dichiara lo stato di emergenza / Allerta Codice 4 e attiva il Servizio di Allerta e Salvaguardia. \"&_RI1&\" - \"&_RI2","v":"Dichiara lo stato di emergenza / Allerta Codice 4 e attiva il Servizio di Allerta e Salvaguardia. RI.2 - RI.3"},null,null,null,null,null,"- Tutti",null,null,null,"--",null,null,null,{"$f":"\"- \"&IF(INDEX(PR,1,9)=\"\",INDEX(PR,1,1),INDEX(PR,1,9))","v":"- Prefettura"}]
["(Codice 4 non preceduto da Codice 2/Codice 3)",null,null,null,null,null,null,null,null,null,null,null,null,null,null,null,null,null,null,{"$f":"\"- \"&IF(INDEX(PRO,1,9)=\"\",INDEX(PRO,1,1),INDEX(PRO,1,9))","v":"- Provincia"},null,null,null,"O1 - O2"]
[null,null,null,null,null,null,null,null,null,null,null,null,null,null,null,null,null,null,null,{"$f":"\"- \"&IF(INDEX(REG,1,9)=\"\",INDEX(REG,1,1),INDEX(REG,1,9))","v":"- Regione"},null,null,null,"C2.1","C2.3","C2.4"]
[]
[{"$f":"IF(INDEX(Sindaco,1,9)=\"\",INDEX(Sindaco,1,1),INDEX(Sindaco,1,9))","v":"SINDACO / R.O.C."},null,null,null,null,{"$f":"\"Nel caso siano necessari, attiva gli interventi di emergenza per riparazione e manutenzione. \"&_RI3&\".1\"","v":"Nel caso siano necessari, attiva gli interventi di emergenza per riparazione e manutenzione. RI.4.1"},null,null,null,null,null,null,null,null,null,"--",null,null,null,"--",null,null,null,"O1 - O2",null,null,{"$f":"_RI3&\".1\"","v":"RI.4.1"}]
[null,null,null,null,null,null,null,null,null,null,null,{"$f":"\"- \"&PROPER(IF(INDEX(RT,1,9)=\"\",INDEX(RT,1,1),INDEX(RT,1,9)))","v":"- Resp. Territorio"}]
[null,null,null,null,null,null,null,null,null,null,null,{"$f":"\"- \"&PROPER(IF(INDEX(CV,1,9)=\"\",INDEX(CV,1,1),INDEX(CV,1,9)))","v":"- C. Volontariato"}]
[]
[{"$f":"IF(INDEX(RT,1,9)=\"\",INDEX(RT,1,1),INDEX(RT,1,9))","v":"RESP. TERRITORIO"},null,null,null,null,{"$f":"\"Responsabile \"&_RI3&\".1\"","v":"Responsabile RI.4.1"},null,null,null,null,null,null,null,null,null,{"$f":"\"- \"&IF(INDEX(TCO,1,9)=\"\",INDEX(TCO,1,1),INDEX(TCO,1,9))","v":"- Tecnici Comunali"},null,null,null,"--",null,null,null,"O1 - O2",null,"A2.1"]
[null,null,null,null,null,null,null,null,null,null,null,{"$f":"\"- \"&PROPER(IF(INDEX(CV,1,9)=\"\",INDEX(CV,1,1),INDEX(CV,1,9)))","v":"- C. Volontariato"},null,null,null,null,null,null,null,null,null,null,null,"A4 - A5 - B2 - B4 - C1"]
[]
[]
[{"$f":"IF(INDEX(CV,1,9)=\"\",INDEX(CV,1,1),INDEX(CV,1,9))","v":"C. VOLONTARIATO"},null,null,null,null,{"$f":"\"Coadiuva \"&_RI3&\".1\"","v":"Coadiuva RI.4.1"},null,null,null,null,null,"--",null,null,null,{"$f":"\"- \"&IF(INDEX(VO,1,9)=\"\",INDEX(VO,1,1),INDEX(VO,1,9))","v":"- Gruppi Volontari"},null,null,null,"--",null,null,null,"A3 - B3"]
["SE LE AZIONI DI VIGILANZA E CONTRASTO SONO SUFFICIENTI OCCORRE CONTINUARE IN TALI ATTIVITA' SINO ALL'ESAURIMENTO DELL'EVENTO. IN CASO CONTRARIO OCCORRE, SE NECESSARIO, ATTIVARE LE SEGUENTI PROCEDURE:"]
[]
[]
[{"$f":"IF(INDEX(Sindaco,1,9)=\"\",INDEX(Sindaco,1,1),INDEX(Sindaco,1,9))","v":"SINDACO / R.O.C."},null,null,null,null,{"$f":"\"Informa la popolazione e gli Enti sovraordinati e provvede alla interdizione di nuove aree. \"&_RI2&\".1\"","v":"Informa la popolazione e gli Enti sovraordinati e provvede alla interdizione di nuove aree. RI.3.1"},null,null,null,null,null,{"$f":"\"- \"&PROPER(IF(INDEX(PL,1,9)=\"\",INDEX(PL,1,1),INDEX(PL,1,9)))","v":"- Polizia Locale"},null,null,null,"--",null,null,null,{"$f":"\"- \"&IF(INDEX(PR,1,9)=\"\",INDEX(PR,1,1),INDEX(PR,1,9))","v":"- Prefettura"}]
[null,null,null,null,null,null,null,null,null,null,null,{"$f":"\"- \"&PROPER(IF(INDEX(CV,1,9)=\"\",INDEX(CV,1,1),INDEX(CV,1,9)))","v":"- C. Volontariato"},null,null,null,null,null,null,null,{"$f":"\"- \"&IF(INDEX(PRO,1,9)=\"\",INDEX(PRO,1,1),INDEX(PRO,1,9))","v":"- Provincia"},null,null,null,"O1 - O2"]
[null,null,null,null,null,null,null,null,null,null,null,{"$f":"\"- \"&PROPER(IF(INDEX(CC,1,9)=\"\",INDEX(CC,1,1),INDEX(CC,1,9)))","v":"- C. Carabinieri"},null,null,null,null,null,null,null,{"$f":"\"- \"&IF(INDEX(REG,1,9)=\"\",INDEX(REG,1,1),INDEX(REG,1,9))","v":"- Regione"},null,null,null,"C2.1","C2.3","C2.4"]
[]
[{"$f":"IF(INDEX(Sindaco,1,9)=\"\",INDEX(Sindaco,1,1),INDEX(Sindaco,1,9))","v":"SINDACO / R.O.C."},null,null,null,null,{"$f":"\"Ordina evacuazioni di Emergenza e attiva le procedure relative: \"","v":"Ordina evacuazioni di Emergenza e attiva le procedure relative: "},null,null,null,null,null,"- Tutti",null,null,null,"--",null,null,null,"--",null,null,null,"O1 - O2"]
[]
[]
[null,null,null,null,null,{"$f":"_RI2&\".2 - \"&_RI2&\".3\"","v":"RI.3.2 - RI.3.3"}]
[{"$f":"IF(INDEX(Sindaco,1,9)=\"\",INDEX(Sindaco,1,1),INDEX(Sindaco,1,9))","v":"SINDACO / R.O.C."},null,null,null,null,{"$f":"\"Attiva la procedura \"&_RI3&\".1 \"&\"in altre aree del territorio eventualmente coinvolte\"","v":"Attiva la procedura RI.4.1 in altre aree del territorio eventualmente coinvolte"},null,null,null,null,null,{"$f":"\"- \"&PROPER(IF(INDEX(RT,1,9)=\"\",INDEX(RT,1,1),INDEX(RT,1,9)))","v":"- Resp. Territorio"},null,null,null,"--",null,null,null,"--",null,null,null,"O1 - O2",null,null,{"$f":"_RI3&\".1\"","v":"RI.4.1"}]
[]
[null,null,null,null,null,null,null,null,null,null,null,{"$f":"\"- \"&PROPER(IF(INDEX(CV,1,9)=\"\",INDEX(CV,1,1),INDEX(CV,1,9)))","v":"- C. Volontariato"}]
["SE L'EVENTO E' GESTIBILE DAL COMUNE"]
[{"$f":"IF(INDEX(Sindaco,1,9)=\"\",INDEX(Sindaco,1,1),INDEX(Sindaco,1,9))","v":"SINDACO / R.O.C."},null,null,null,null,"Informa periodicamente gli enti sovraordinati e i media su quanto fatto.",null,null,null,null,null,"- Tutti",null,null,null,"--",null,null,null,{"$f":"\"- \"&IF(INDEX(PR,1,9)=\"\",INDEX(PR,1,1),INDEX(PR,1,9))","v":"- Prefettura"}]
[null,null,null,null,null,null,null,null,null,null,null,null,null,null,null,null,null,null,null,{"$f":"\"- \"&IF(INDEX(PRO,1,9)=\"\",INDEX(PRO,1,1),INDEX(PRO,1,9))","v":"- Provincia"},null,null,null,"O1 - O2"]
[null,null,null,null,null,null,null,null,null,null,null,null,null,null,null,null,null,null,null,{"$f":"\"- \"&IF(INDEX(REG,1,9)=\"\",INDEX(REG,1,1),INDEX(REG,1,9))","v":"- Regione"},null,null,null,"C2.1","C2.3","C2.4"]
[]
[{"$f":"IF(INDEX(Sindaco,1,9)=\"\",INDEX(Sindaco,1,1),INDEX(Sindaco,1,9))","v":"SINDACO / R.O.C."},null,null,null,null,"Informa sulla revoca dello stato di Allerta Codice 4.",null,null,null,null,null,"- Tutti",null,null,null,{"$f":"\"- \"&IF(INDEX(SC,1,9)=\"\",INDEX(SC,1,1),INDEX(SC,1,9))","v":"- Squadre Operativi"},null,null,null,{"$f":"\"- \"&IF(INDEX(PR,1,9)=\"\",INDEX(PR,1,1),INDEX(PR,1,9))","v":"- Prefettura"},null,null,null,"O1 - O2"]
[null,null,null,null,null,null,null,null,null,null,null,null,null,null,null,null,null,null,null,{"$f":"\"- \"&IF(INDEX(PRO,1,9)=\"\",INDEX(PRO,1,1),INDEX(PRO,1,9))","v":"- Provincia"},null,null,null,"C2.1","C2.3","C2.4"]
["MEMBRI U.C.L",null,null,null,null,null,null,null,null,null,null,null,null,null,null,null,null,null,null,{"$f":"\"- \"&IF(INDEX(REG,1,9)=\"\",INDEX(REG,1,1),INDEX(REG,1,9))","v":"- Regione"},null,null,null,"M1","M2"]
[]
["SE L'EVENTO NON E' GESTIBILE DAL COMUNE"]
[{"$f":"IF(INDEX(Sindaco,1,9)=\"\",INDEX(Sindaco,1,1),INDEX(Sindaco,1,9))","v":"SINDACO / R.O.C."},null,null,null,null,"Informa i media e gli enti sovraordinati. ",null,null,null,null,null,"--",null,null,null,"--",null,null,null,{"$f":"\"- \"&IF(INDEX(PR,1,9)=\"\",INDEX(PR,1,1),INDEX(PR,1,9))","v":"- Prefettura"}]
[null,null,null,null,null,null,null,null,null,null,null,null,null,null,null,null,null,null,null,{"$f":"\"- \"&IF(INDEX(PRO,1,9)=\"\",INDEX(PRO,1,1),INDEX(PRO,1,9))","v":"- Provincia"},null,null,null,"C2.1","C2.3","C2.4"]
[null,null,null,null,null,null,null,null,null,null,null,null,null,null,null,null,null,null,null,{"$f":"\"- \"&IF(INDEX(REG,1,9)=\"\",INDEX(REG,1,1),INDEX(REG,1,9))","v":"- Regione"}]
[]
[{"$f":"IF(INDEX(Sindaco,1,9)=\"\",INDEX(Sindaco,1,1),INDEX(Sindaco,1,9))","v":"SINDACO / R.O.C."},null,null,null,null,{"$f":"\"Si coordina con il \"&COM&\" e attiva le aree di ammassamento soccorsi. \"&_RI3&\".2\"","v":"Si coordina con il COM Monza e attiva le aree di ammassamento soccorsi. RI.4.2"},null,null,null,null,null,null,null,null,null,"--",null,null,null,{"$f":"\"- \"&COM","v":"- COM Monza"},null,null,null,null,null,null,{"$f":"_RI3&\".2\"","v":"RI.4.2"}]
[null,null,null,null,null,null,null,null,null,null,null,{"$f":"\"- \"&PROPER(IF(INDEX(RT,1,9)=\"\",INDEX(RT,1,1),INDEX(RT,1,9)))","v":"- Resp. Territorio"},null,null,null,null,null,null,null,null,null,null,null,"O1 - O2",null,"C2.1"]
[null,null,null,null,null,null,null,null,null,null,null,{"$f":"\"- \"&PROPER(IF(INDEX(CV,1,9)=\"\",INDEX(CV,1,1),INDEX(CV,1,9)))","v":"- C. Volontariato"}]
[]
[{"$f":"IF(INDEX(RT,1,9)=\"\",INDEX(RT,1,1),INDEX(RT,1,9))","v":"RESP. TERRITORIO"},null,null,null,null,{"$f":"\"Responsabile \"&_RI3&\".2\"","v":"Responsabile RI.4.2"},null,null,null,null,null,null,null,null,null,{"$f":"\"- \"&IF(INDEX(TCO,1,9)=\"\",INDEX(TCO,1,1),INDEX(TCO,1,9))","v":"- Tecnici Comunali"},null,null,null,"--",null,null,null,"O1 - O2",null,"A2.1"]
[null,null,null,null,null,null,null,null,null,null,null,{"$f":"\"- \"&PROPER(IF(INDEX(CV,1,9)=\"\",INDEX(CV,1,1),INDEX(CV,1,9)))","v":"- C. Volontariato"},null,null,null,null,null,null,null,null,null,null,null,"A4 A5 A6 A8 B5 B6 C1"]
[]
[{"$f":"IF(INDEX(CV,1,9)=\"\",INDEX(CV,1,1),INDEX(CV,1,9))","v":"C. VOLONTARIATO"},null,null,null,null,{"$f":"\"Coadiuva \"&_RI3&\".2\"","v":"Coadiuva RI.4.2"},null,null,null,null,null,"--",null,null,null,{"$f":"\"- \"&IF(INDEX(VO,1,9)=\"\",INDEX(VO,1,1),INDEX(VO,1,9))","v":"- Gruppi Volontari"},null,null,null,"--",null,null,null,"A3 - B3"]
[]
["PER LE COMUNICAZIONI EVIDENZIATE IN ROSSO UTILIZZARE IL MODULO FAX M4"]
[]
[{"$f":"Titolo3","v":"Scheda Procedura Operativa"},null,null,null,null,null,null,null,null,null,null,null,null,null,null,null,null,null,null,null,null,null,null,{"$f":"X4","v":"RI.4"}]
[]
[{"$f":"$A$6","v":"Rischio Idrogeologico - Fase di Allerta Codice 4"}]
[]
[]
[null,"Codice Scheda Scenario",null,null,null,null,null,{"$f":"X4","v":"RI.4"}]
[null,"Tipo di Procedure",null,null,null,null,null,{"$f":"_RI3&\".1 \"&_RI3&\".2 - SERVIZIO DI SOCCORSO\"","v":"RI.4.1 RI.4.2 - SERVIZIO DI SOCCORSO"}]
[null,"Ubicazione intervento",null,null,null,null,null,"Non prevedibile a priori"]
[null,"Aree di raccolta popolazione",null,null,null,null,null,{"$f":"IF(INDEX(RI2RIC,1,1)=\"\",\"In questa fase non è prevista l’attivazione di tali aree.\",\"Per questa emergenza \"&IF(INDEX(RI2RIC,1,2)=\"\",\"è disponibile la seguente area:\",\"sono disponibili le seguenti aree:\"))","v":"Per questa emergenza sono disponibili le seguenti aree:"}]
[null,null,null,null,null,null,null,{"$f":"IF(INDEX(RI2RIC,1,1)=\"\",\"\",\"- \"&VLOOKUP(INDEX(RI2RIC,1,1),Ricovero,2))","v":"- Centro Sportivo Comunale - Carta AE.41 - Trescore Cremasco - Ricovero/Tendopoli"}]
[null,null,null,null,null,null,null,{"$f":"IF(INDEX(RI2RIC,1,2)=\"\",\"\",\"- \"&VLOOKUP(INDEX(RI2RIC,1,2),Ricovero,2))","v":"- Scuola Secondaria di I Grado \"Manzoni\" - Carta AE.42 - Trescore Cremasco - Ricovero"}]
[null,null,null,null,null,null,null,{"$f":"IF(INDEX(RI2RIC,1,3)=\"\",\"\",\"- \"&VLOOKUP(INDEX(RI2RIC,1,3),Ricovero,2))","v":"- Scuola Primaria Trescore Cremasco - Carta AE.43 - Trescore Cremasco - Ricovero"}]
[null,"Aree di ricovero",null,null,null,null,null,{"$f":"IF(INDEX(RI2RIC,1,4)=\"\",\"\",\"- \"&VLOOKUP(INDEX(RI2RIC,1,4),Ricovero,2))","v":""}]
[null,null,null,null,null,null,null,{"$f":"IF(INDEX(RI2RIC,1,5)=\"\",\"\",\"- \"&VLOOKUP(INDEX(RI2RIC,1,5),Ricovero,2))","v":""}]
[null,null,null,null,null,null,null,{"$f":"IF(INDEX(RI2RIC,1,6)=\"\",\"\",\"- \"&VLOOKUP(INDEX(RI2RIC,1,6),Ricovero,2))","v":""}]
[null,null,null,null,null,null,null,{"$f":"IF(INDEX(RI2RIC,1,7)=\"\",\"\",\"- \"&VLOOKUP(INDEX(RI2RIC,1,7),Ricovero,2))","v":""}]
[null,null,null,null,null,null,null,{"$f":"IF(H194=\"\",\"\",\"In funzione della gravità della situazione si decide quali/quante aree attivare.\")","v":"In funzione della gravità della situazione si decide quali/quante aree attivare."}]
[null,"Aree di raduno soccorritori",null,null,null,null,null,{"$f":"IF(INDEX(RI2SOC,1,1)=\"\",\"In questa fase non è prevista l’attivazione di tali aree.\",\"Per questa emergenza \"&IF(INDEX(RI2SOC,1,2)=\"\",\"è disponibile la seguente area:\",\"sono disponibili le seguenti aree:\"))","v":"Per questa emergenza sono disponibili le seguenti aree:"}]
[null,null,null,null,null,null,null,{"$f":"IF(INDEX(RI2SOC,1,1)=\"\",\"\",\"- \"&VLOOKUP(INDEX(RI2SOC,1,1),Soccorritori,2))","v":"- Centro Sportivo Comunale - Carte AE.41 - Trescore Cremasco - SV.41 - Aviosuperficie"}]
[null,null,null,null,null,null,null,{"$f":"IF(INDEX(RI2SOC,1,2)=\"\",\"\",\"- \"&VLOOKUP(INDEX(RI2SOC,1,2),Soccorritori,2))","v":"- Centro Sportivo Comunale - Carte AE.41 - Trescore Cremasco - SV.41 - Ammassamento"}]
[null,null,null,null,null,null,null,{"$f":"IF(INDEX(RI2SOC,1,3)=\"\",\"\",\"- \"&VLOOKUP(INDEX(RI2SOC,1,3),Soccorritori,2))","v":""}]
[null,null,null,null,null,null,null,{"$f":"IF(H203=\"\",\"\",\"In funzione della gravità della situazione si decide quali/quante aree attivare.\")","v":"In funzione della gravità della situazione si decide quali/quante aree attivare."}]
[null,"Cancelli e vie alternative",null,null,null,null,null,"I cancelli di regolazione del traffico vengono posizionati in funzione della estensione dell'evento."]
[]
[null,"Contatti Utili",null,null,null,null,null,"Si faccia riferimento al PRONTUARIO DI EMERGENZA - CONTATTI"]
[]
[]
[]
[]
[]
[]
[null,null,"Procedura Operativa Standard (POS)",null,null,null,null,null,null,null,null,null,null,null,null,null,"Procedure Previste"]
[null,null,null,null,null,null,null,null,null,null,null,null,null,null,null,null,{"$f":"MID(H190,1,6)","v":"RI.4.1"},null,null,null,{"$f":"MID(H190,8,6)","v":"RI.4.2"}]
[null,null,1,"Monitoraggio",null,null,null,null,null,null,null,null,null,null,null,null,"--",null,null,null,"--"]
[null,null,2,"Perlustrazione",null,null,null,null,null,null,null,null,null,null,null,null,"--",null,null,null,"--"]
[null,null,3,"Presidio Cancelli/Supporto Viabilità",null,null,null,null,null,null,null,null,null,null,null,null,"--",null,null,null,"--"]
[null,null,4,"Informazione Diretta alla Popolazione",null,null,null,null,null,null,null,null,null,null,null,null,"--",null,null,null,"--"]
[null,null,5,"Allestimento Area di Ricovero",null,null,null,null,null,null,null,null,null,null,null,null,"--",null,null,null,"--"]
[null,null,6,"Allestimento Area di Ammassamento Soccorsi",null,null,null,null,null,null,null,null,null,null,null,null,"--",null,null,null,"X"]
[null,null,7,"Evacuazione",null,null,null,null,null,null,null,null,null,null,null,null,"--",null,null,null,"--"]
[null,null,8,"Rimozione Ostacoli",null,null,null,null,null,null,null,null,null,null,null,null,"X",null,null,null,"--"]
[null,null,9,"Rimozione Ostacoli da Alveo",null,null,null,null,null,null,null,null,null,null,null,null,"X",null,null,null,"--"]
[null,null,10,"Preservazione Argini",null,null,null,null,null,null,null,null,null,null,null,null,"X",null,null,null,"--"]
[null,null,11,"Frana",null,null,null,null,null,null,null,null,null,null,null,null,"X",null,null,null,"--"]

{"sheet":"AIB_2","index":4,"n_rows":222,"n_cols":27,"rows_kept":222,"cut":false,"hidden":false,"merged":[[10,1,14,9],[10,10,14,24],[15,1,19,9],[15,10,19,24],[20,1,21,9],[20,10,21,24],[22,1,24,9],[22,10,22,16],[9,10,9,24],[22,17,24,24],[0,0,1,6],[0,7,1,18],[0,19,1,25],[3,0,4,22],[3,23,6,25],[5,0,6,22],[8,1,8,9],[8,10,8,24],[9,1,9,9],[128,0,130,4],[128,5,130,10],[128,11,128,25],[129,11,130,14],[129,15,130,18],[129,19,130,22],[129,23,130,25],[58,10,58,24],[123,0,124,22],[123,23,126,25],[125,0,126,22],[59,10,59,24],[58,1,59,9],[131,0,133,4],[131,5,133,10],[131,11,131,14],[131,15,133,18],[131,19,131,22],[132,11,132,14],[132,19,132,22],[133,11,133,14],[133,19,133,22],[137,15,139,18],[137,19,139,22],[137,23,139,25],[134,0,136,4],[134,5,136,10],[134,11,136,14],[134,15,136,18],[134,19,136,22],[134,23,136,25],[183,0,184,22],[183,23,186,25],[185,0,186,22],[145,19,145,22],[146,19,146,22],[147,19,147,22],[137,26,143,26],[138,11,138,14],[139,11,139,14],[140,0,141,4],[140,5,141,10],[140,11,140,14],[140,15,141,18],[140,19,141,22],[140,23,141,25],[141,11,141,14],[143,0,143,4],[143,5,143,10],[143,11,143,14],[143,15,143,18],[143,19,143,22],[143,23,143,25],[142,0,142,4],[142,5,142,10],[188,1,188,9],[188,10,188,24],[189,1,189,9],[189,10,189,24],[190,1,190,9],[190,10,190,24],[191,1,193,9],[191,10,191,24],[192,10,192,24],[193,10,193,24],[216,15,216,23],[212,3,212,14],[213,3,213,14],[214,3,214,14],[215,3,215,14],[216,3,216,14],[211,3,211,14],[194,1,196,9],[194,10,194,24],[195,10,195,24],[196,10,196,24],[197,1,200,9],[197,10,197,24],[198,10,198,24],[199,10,199,24],[201,1,201,9],[201,10,201,24],[209,2,210,14],[209,15,209,23],[210,15,210,23],[202,1,204,9],[202,10,204,24],[200,10,200,24],[221,15,221,23],[220,15,220,23],[217,15,217,23],[218,15,218,23],[219,15,219,23],[211,15,211,23],[148,0,148,25],[149,0,151,4],[149,5,151,10],[149,11,149,14],[149,15,151,18],[149,19,151,22],[149,23,151,25],[150,11,150,14],[151,11,151,14],[217,3,217,14],[218,3,218,14],[219,3,219,14],[220,3,220,14],[221,3,221,14],[212,15,212,23],[213,15,213,23],[214,15,214,23],[215,15,215,23],[156,0,156,25],[152,23,152,25],[131,23,131,25],[132,23,132,25],[145,23,145,25],[144,0,144,25],[145,0,147,4],[145,5,147,10],[145,11,147,14],[145,15,147,18],[152,0,154,4],[152,5,154,10],[152,11,152,14],[152,15,154,18],[152,19,154,22],[153,11,153,14],[154,11,154,14],[142,11,142,14],[142,15,142,18],[142,19,142,22],[142,23,142,25],[137,0,139,4],[137,5,139,10],[137,11,137,14],[43,10,43,24],[31,1,35,9],[31,10,35,24],[36,1,38,9],[36,10,36,24],[39,1,41,9],[42,1,45,9],[46,1,48,9],[49,1,51,9],[49,11,49,24],[50,11,50,24],[51,11,51,24],[25,1,27,9],[25,10,27,24],[28,1,30,9],[28,10,30,24],[23,10,23,16],[24,10,24,16],[63,0,64,22],[63,23,66,25],[65,0,66,22],[52,1,56,9],[52,10,56,24],[57,1,57,9],[57,10,57,24],[46,10,46,24],[37,10,37,24],[38,10,38,24],[44,10,44,24],[45,10,45,24],[47,10,47,24],[48,10,48,24],[39,10,39,24],[40,10,40,24],[41,10,41,24],[42,10,42,24]]}
[{"$f":"NCOM&\" (\"&PCOM&\")\"","v":"Comune di Trescore Cremasco (CR)"},null,null,null,null,null,null,{"$f":"IF(INDEX(INT,1,13)=\"\",INDEX(INT,1,1),INDEX(INT,1,13))","v":"Piano di Emergenza Intercomunale di Protezione Civile"},null,null,null,null,null,null,null,null,null,null,null,{"$f":"IF(TIPOP=\"Edizione\",\"Ed. \",IF(TIPOP=\"Revisione\",\"Rev. \",\"Bozza \"))&TIPON&\" del \"&TIPOD","v":"Ed. 01 del 04/11/2012"}]
[]
[]
["Scheda Scenario",null,null,null,null,null,null,null,null,null,null,null,null,null,null,null,null,null,null,null,null,null,null,{"$f":"_AIB2","v":"AIB.2"}]
[]
[{"$f":"IF(INDEX(AIB2PAR,1,19)=\"\",INDEX(AIB2PAR,1,12),INDEX(AIB2PAR,1,19))&\" - Fase di Allarme\"","v":"Rischio Incendio Boschivo - Fase di Allarme"}]
[]
[]
[null,"Paragrafi di Riferimento ",null,null,null,null,null,null,null,null,{"$f":"INDEX(AIB2PAR,1,1)&INDEX(AIB2PAR,1,12)","v":"2.2.4 - 3.3.3 Procedure per il Rischio Incendio Boschivo"}]
[null,"Codice Scheda",null,null,null,null,null,null,null,null,{"$f":"X4","v":"AIB.2"}]
[null,"Evento atteso",null,null,null,null,null,null,null,null,"Incendio in atto su aree boscate, cespugliate o arborate oppure su terreni coltivati o incolti e pascoli compresi all'interno della Fascia Perimentrale dei centri abitati."]
[]
[]
[]
[]
[null,"Attività U.C.L.",null,null,null,null,null,null,null,null,"Supporta e collabora col D.O.S. (Direttore Operazioni di Spegnimento), agente CFS (Corpo Forestale dello Stato) o delegato Ente territorialmente competente (Parco o Provincia) che gestisce in prima persona le operazioni di spegnimento."]
[]
[]
[]
[]
[null,"Ubicazione intervento",null,null,null,null,null,null,null,null,"Aree limitrofe alla zona interessata dall'incendio boschivo."]
[]
[null,"Personale mobilitato",null,null,null,null,null,null,null,null,{"$f":"IF(INDEX(AIB2PER,1,1)=\"\",\"\",\"- \"&VLOOKUP(INDEX(AIB2PER,1,1),Personale,IF(INDEX(Personale,INDEX(AIB2PER,1,1),14)=\"\",2,14)))","v":"- Polizia Locale"},null,null,null,null,null,null,"Riportare la composizione delle squadre nel Modulo M1"]
[null,null,null,null,null,null,null,null,null,null,{"$f":"IF(INDEX(AIB2PER,1,2)=\"\",\"\",\"- \"&VLOOKUP(INDEX(AIB2PER,1,2),Personale,IF(INDEX(Personale,INDEX(AIB2PER,1,2),14)=\"\",2,14)))","v":"- Volontari P.C."}]
[null,null,null,null,null,null,null,null,null,null,{"$f":"IF(INDEX(AIB2PER,1,3)=\"\",\"\",\"- \"&VLOOKUP(INDEX(AIB2PER,1,3),Personale,IF(INDEX(Personale,INDEX(AIB2PER,1,3),14)=\"\",2,14)))","v":""}]
[null,"Attività personale mobilitato",null,null,null,null,null,null,null,null,"Supporto logistico, chiusura strade. "]
[]
[]
[null,"Grado di coinvolgimento della popolazione",null,null,null,null,null,null,null,null,"Nessuno."]
[]
[]
[null,"Cancelli e vie alternative",null,null,null,null,null,null,null,null,"Da decidersi in collaborazione con il DOS."]
[]
[]
[]
[]
[null,"Aree di raccolta popolazione",null,null,null,null,null,null,null,null,{"$f":"IF(INDEX(AIB2RIC,1,1)=\"\",\"In questa fase non è prevista l’attivazione di tali aree.\",\"Per questa emergenza \"&IF(INDEX(AIB2RIC,1,2)=\"\",\"è disponibile la seguente area:\",\"sono disponibili le seguenti aree:\"))","v":"In questa fase non è prevista l’attivazione di tali aree."}]
[null,null,null,null,null,null,null,null,null,null,{"$f":"IF(INDEX(AIB2RIC,1,1)=\"\",\"\",\"- \"&VLOOKUP(INDEX(AIB2RIC,1,1),Ricovero,2))","v":""}]
[null,null,null,null,null,null,null,null,null,null,{"$f":"IF(INDEX(AIB2RIC,1,2)=\"\",\"\",\"- \"&VLOOKUP(INDEX(AIB2RIC,1,2),Ricovero,2))","v":""}]
[null,"Area di ricovero",null,null,null,null,null,null,null,null,{"$f":"IF(INDEX(AIB2RIC,1,3)=\"\",\"\",\"- \"&VLOOKUP(INDEX(AIB2RIC,1,3),Ricovero,2))","v":""}]
[null,null,null,null,null,null,null,null,null,null,{"$f":"IF(INDEX(AIB2RIC,1,4)=\"\",\"\",\"- \"&VLOOKUP(INDEX(AIB2RIC,1,4),Ricovero,2))","v":""}]
[null,null,null,null,null,null,null,null,null,null,{"$f":"IF(K39=\"\",\"\",\"In funzione della gravità della situazione si decide quali/quante aree attivare.\")","v":""}]
[null,"Area di raduno soccorritori",null,null,null,null,null,null,null,null,{"$f":"IF(INDEX(AIB2SOC,1,1)=\"\",\"In questa fase non è prevista l’attivazione di tali aree.\",\"Per questa emergenza \"&IF(INDEX(AIB2SOC,1,2)=\"\",\"è disponibile la seguente area:\",\"sono disponibili le seguenti aree:\"))","v":"In questa fase non è prevista l’attivazione di tali aree."}]
[null,null,null,null,null,null,null,null,null,null,{"$f":"IF(INDEX(AIB2SOC,1,1)=\"\",\"\",\"- \"&VLOOKUP(INDEX(AIB2SOC,1,1),Ricovero,2))","v":""}]
[null,null,null,null,null,null,null,null,null,null,{"$f":"IF(INDEX(AIB2SOC,1,2)=\"\",\"\",\"- \"&VLOOKUP(INDEX(AIB2SOC,1,2),Ricovero,2))","v":""}]
[null,null,null,null,null,null,null,null,null,null,{"$f":"IF(K44=\"\",\"\",\"In funzione della gravità della situazione si decide quali/quante aree attivare.\")","v":""}]
[null,"Ordinanze Necessarie",null,null,null,null,null,null,null,null,"Ordinanza di Chiusura Strade."]
[]
[]
[null,"Modalita’ Riunione U.C.L.",null,null,null,null,null,null,null,null,null,"Non necessaria"]
[null,null,null,null,null,null,null,null,null,null,"X","Virtuale"]
[null,null,null,null,null,null,null,null,null,null,null,"In sede"]
[null,"Possibili Scenari Concomitanti",null,null,null,null,null,null,null,null,"Non ragionevolmente prevedibile la concomitanza con altri eventi."]
[]
[]
[]
[]
[null,"Contatti Utili",null,null,null,null,null,null,null,null,{"$f":"\"Consultare il \"&IF([1]Maschera!Z71=\"\",[1]Maschera!N71,[1]Maschera!Z71)","v":"Consultare il Tomo Giallo - Risorse"}]
[null,"Cartografia",null,null,null,null,null,null,null,null,{"$f":"INDEX(AIB2PAR,1,28)","v":"Tav. 3/C - Rischio Viabilità - AIB - Altri Rischi"}]
[null,null,null,null,null,null,null,null,null,null,{"$f":"INDEX(AIB2PAR,1,39)","v":"Tav. 3/D - Stradario Piano di Emergenza"}]
[]
[]
[]
[{"$f":"Titolo2","v":"Procedure U.C.L."},null,null,null,null,null,null,null,null,null,null,null,null,null,null,null,null,null,null,null,null,null,null,{"$f":"_AIB2","v":"AIB.2"}]
[]
[{"$f":"$A$6","v":"Rischio Incendio Boschivo - Fase di Allarme"}]
[]
[]
[]
[]
[]
[]
[]
[]
[]
[]
[]
[]
[]
[]
[]
[]
[]
[]
[]
[]
[]
[]
[]
[]
[]
[]
[]
[]
[]
[]
[]
[]
[]
[]
[]
[]
[]
[]
[]
[]
[]
[]
[]
[]
[]
[]
[]
[]
[]
[]
[]
[]
[]
[]
[]
[]
[]
[{"$f":"Titolo2","v":"Procedure U.C.L."},null,null,null,null,null,null,null,null,null,null,null,null,null,null,null,null,null,null,null,null,null,null,{"$f":"X4","v":"AIB.2"}]
[]
[{"$f":"$A$6","v":"Rischio Incendio Boschivo - Fase di Allarme"}]
[]
[]
["RESPONSABILE",null,null,null,null,"AZIONE",null,null,null,null,null,"CHIAMATE"]
[null,null,null,null,null,null,null,null,null,null,null,"MEMBRO UCL",null,null,null,"OPERATIVI",null,null,null,"ENTE INTERESSATO",null,null,null,"SCHEDE CHIAMATE"]
[]
[{"$f":"IF(INDEX(ROC,1,9)=\"\",INDEX(ROC,1,1),INDEX(ROC,1,9))","v":"R.O.C."},null,null,null,null,"Avvisa della Fase di Allarme.",null,null,null,null,null,{"$f":"\"- \"&PROPER(IF(INDEX(Sindaco,1,9)=\"\",LEFT(INDEX(Sindaco,1,1),7),INDEX(Sindaco,1,9)))","v":"- Sindaco"},null,null,null,"--",null,null,null,{"$f":"\"- \"&IF(INDEX(PR,1,9)=\"\",INDEX(PR,1,1),INDEX(PR,1,9))","v":"- Prefettura"},null,null,null,"O1 - O2"]
[null,null,null,null,null,null,null,null,null,null,null,{"$f":"\"- \"&PROPER(IF(INDEX(PL,1,9)=\"\",INDEX(PL,1,1),INDEX(PL,1,9)))","v":"- Polizia Locale"},null,null,null,null,null,null,null,{"$f":"\"- \"&IF(INDEX(PRO,1,9)=\"\",INDEX(PRO,1,1),INDEX(PRO,1,9))","v":"- Provincia"},null,null,null,"C2.1  C2.4"]
[null,null,null,null,null,null,null,null,null,null,null,{"$f":"\"- \"&PROPER(IF(INDEX(CV,1,9)=\"\",INDEX(CV,1,1),INDEX(CV,1,9)))","v":"- C. Volontariato"},null,null,null,null,null,null,null,{"$f":"\"- \"&IF(INDEX(REG,1,9)=\"\",INDEX(REG,1,1),INDEX(REG,1,9))","v":"- Regione"}]
[{"$f":"IF(INDEX(Sindaco,1,9)=\"\",INDEX(Sindaco,1,1),INDEX(Sindaco,1,9))","v":"SINDACO / R.O.C."},null,null,null,null,"Invia il C.te della Polizia Locale, o delegato, a supporto del DOS.",null,null,null,null,null,"--",null,null,null,"--",null,null,null,"--",null,null,null,"O1 - O2"]
[]
[]
[{"$f":"IF(INDEX(Sindaco,1,9)=\"\",INDEX(Sindaco,1,1),INDEX(Sindaco,1,9))","v":"SINDACO / R.O.C."},null,null,null,null,{"$f":"\"In accordo col DOS organizza cancelli per il traffico. \"&_AIB2&\".1\"","v":"In accordo col DOS organizza cancelli per il traffico. AIB.2.1"},null,null,null,null,null,{"$f":"\"- \"&PROPER(IF(INDEX(PL,1,9)=\"\",INDEX(PL,1,1),INDEX(PL,1,9)))","v":"- Polizia Locale"},null,null,null,"--",null,null,null,"--",null,null,null,"O1 - O2",null,null,{"$f":"_AIB2&\".1\"","v":"AIB.2.1"}]
[null,null,null,null,null,null,null,null,null,null,null,{"$f":"\"- \"&PROPER(IF(INDEX(CV,1,9)=\"\",INDEX(CV,1,1),INDEX(CV,1,9)))","v":"- C. Volontariato"}]
[null,null,null,null,null,null,null,null,null,null,null,{"$f":"\"- \"&PROPER(IF(INDEX(CC,1,9)=\"\",INDEX(CC,1,1),INDEX(CC,1,9)))","v":"- C. Carabinieri"}]
[{"$f":"IF(INDEX(PL,1,9)=\"\",INDEX(PL,1,1),INDEX(PL,1,9))","v":"POLIZIA LOCALE"},null,null,null,null,{"$f":"\"Responsabile \"&_AIB2&\".1\"","v":"Responsabile AIB.2.1"},null,null,null,null,null,{"$f":"\"- \"&PROPER(IF(INDEX(CV,1,9)=\"\",INDEX(CV,1,1),INDEX(CV,1,9)))","v":"- C. Volontariato"},null,null,null,{"$f":"\"- \"&IF(INDEX(PLO,1,9)=\"\",INDEX(PLO,1,1),INDEX(PLO,1,9))","v":"- Agenti P.L."},null,null,null,"--",null,null,null,"O1 - O2  A2.2"]
[null,null,null,null,null,null,null,null,null,null,null,{"$f":"\"- \"&PROPER(IF(INDEX(CC,1,9)=\"\",INDEX(CC,1,1),INDEX(CC,1,9)))","v":"- C. Carabinieri"}]
[{"$f":"IF(INDEX(CV,1,9)=\"\",INDEX(CV,1,1),INDEX(CV,1,9))","v":"C. VOLONTARIATO"},null,null,null,null,{"$f":"\"Coadiuva \"&_AIB2&\".1\"","v":"Coadiuva AIB.2.1"},null,null,null,null,null,"--",null,null,null,{"$f":"\"- \"&IF(INDEX(VO,1,9)=\"\",INDEX(VO,1,1),INDEX(VO,1,9))","v":"- Gruppi Volontari"},null,null,null,"--",null,null,null,"A3 - B3"]
[{"$f":"IF(INDEX(CC,1,9)=\"\",INDEX(CC,1,1),INDEX(CC,1,9))","v":"C. CARABINIERI"},null,null,null,null,{"$f":"\"Coadiuva \"&_AIB2&\".1\"","v":"Coadiuva AIB.2.1"},null,null,null,null,null,"--",null,null,null,{"$f":"\"- \"&IF(INDEX(CO,1,9)=\"\",INDEX(CO,1,1),INDEX(CO,1,9))","v":"- Carabinieri"},null,null,null,"--",null,null,null,"--"]
["SE L'INCENDIO SI AVVICINA AL CENTRO ABITATO"]
[{"$f":"IF(INDEX(Sindaco,1,9)=\"\",INDEX(Sindaco,1,1),INDEX(Sindaco,1,9))","v":"SINDACO / R.O.C."},null,null,null,null,"Attiva la Fase di Emergenza.",null,null,null,null,null,"- Tutti",null,null,null,"--",null,null,null,{"$f":"\"- \"&IF(INDEX(PR,1,9)=\"\",INDEX(PR,1,1),INDEX(PR,1,9))","v":"- Prefettura"},null,null,null,"O1 - O2"]
[null,null,null,null,null,null,null,null,null,null,null,null,null,null,null,null,null,null,null,{"$f":"\"- \"&IF(INDEX(PRO,1,9)=\"\",INDEX(PRO,1,1),INDEX(PRO,1,9))","v":"- Provincia"},null,null,null,"C2.1","C2.3","C2.4"]
[null,null,null,null,null,null,null,null,null,null,null,null,null,null,null,null,null,null,null,{"$f":"\"- \"&IF(INDEX(REG,1,9)=\"\",INDEX(REG,1,1),INDEX(REG,1,9))","v":"- Regione"}]
["SE L'INCENDIO VIENE DOMATO"]
[{"$f":"IF(INDEX(Sindaco,1,9)=\"\",INDEX(Sindaco,1,1),INDEX(Sindaco,1,9))","v":"SINDACO / R.O.C."},null,null,null,null,"Avvisa della cessazione della Fase di Allarme.",null,null,null,null,null,{"$f":"\"- \"&PROPER(IF(INDEX(PL,1,9)=\"\",INDEX(PL,1,1),INDEX(PL,1,9)))","v":"- Polizia Locale"},null,null,null,"--",null,null,null,"--",null,null,null,"O1 - O2"]
[null,null,null,null,null,null,null,null,null,null,null,{"$f":"\"- \"&PROPER(IF(INDEX(CV,1,9)=\"\",INDEX(CV,1,1),INDEX(CV,1,9)))","v":"- C. Volontariato"}]
[null,null,null,null,null,null,null,null,null,null,null,{"$f":"\"- \"&PROPER(IF(INDEX(CC,1,9)=\"\",INDEX(CC,1,1),INDEX(CC,1,9)))","v":"- C. Carabinieri"}]
[{"$f":"IF(INDEX(PL,1,9)=\"\",INDEX(PL,1,1),INDEX(PL,1,9))","v":"POLIZIA LOCALE"},null,null,null,null,"Se informato del cessato allarme dispone il rientro delle squadre.",null,null,null,null,null,{"$f":"\"- \"&PROPER(IF(INDEX(CV,1,9)=\"\",INDEX(CV,1,1),INDEX(CV,1,9)))","v":"- C. Volontariato"},null,null,null,{"$f":"\"- \"&IF(INDEX(SC,1,9)=\"\",INDEX(SC,1,1),INDEX(SC,1,9))","v":"- Squadre Operativi"},null,null,null,"--",null,null,null,"O1 - O2  C2.3"]
[null,null,null,null,null,null,null,null,null,null,null,{"$f":"\"- \"&PROPER(IF(INDEX(CC,1,9)=\"\",INDEX(CC,1,1),INDEX(CC,1,9)))","v":"- C. Carabinieri"},null,null,null,null,null,null,null,null,null,null,null,"M1","M2"]
[]
[]
["PER LE COMUNICAZIONI EVIDENZIATE IN ROSSO UTILIZZARE IL MODULO FAX M4"]
[]
[]
[]
[]
[]
[]
[]
[]
[]
[]
[]
[]
[]
[]
[]
[]
[]
[]
[]
[]
[]
[]
[]
[]
[]
[]
[{"$f":"Titolo3","v":"Scheda Procedura Operativa"},null,null,null,null,null,null,null,null,null,null,null,null,null,null,null,null,null,null,null,null,null,null,{"$f":"X4","v":"AIB.2"}]
[]
[{"$f":"$A$6","v":"Rischio Incendio Boschivo - Fase di Allarme"}]
[]
[]
[null,"Codice Scheda Scenario",null,null,null,null,null,null,null,null,{"$f":"X4","v":"AIB.2"}]
[null,"Tipo di Procedure",null,null,null,null,null,null,null,null,{"$f":"_AIB2&\".1 - SUPPORTO DOS\"","v":"AIB.2.1 - SUPPORTO DOS"}]
[null,"Ubicazione intervento",null,null,null,null,null,null,null,null," --"]
[null,"Aree di raccolta popolazione",null,null,null,null,null,null,null,null,{"$f":"K38","v":""}]
[null,null,null,null,null,null,null,null,null,null,""]
[null,null,null,null,null,null,null,null,null,null,""]
[null,"Area di ricovero",null,null,null,null,null,null,null,null,""]
[null,null,null,null,null,null,null,null,null,null,""]
[null,null,null,null,null,null,null,null,null,null,"In questa fase non è prevista l’attivazione di tali aree."]
[null,"Area di raduno soccorritori",null,null,null,null,null,null,null,null,""]
[null,null,null,null,null,null,null,null,null,null,""]
[null,null,null,null,null,null,null,null,null,null,""]
[null,null,null,null,null,null,null,null,null,null,"Ordinanza di Chiusura Strade."]
[null,"Cancelli e vie alternative",null,null,null,null,null,null,null,null," --"]
[null,"Contatti Utili",null,null,null,null,null,null,null,null,"Si faccia riferimento al PRONTUARIO DI EMERGENZA - CONTATTI"]
[]
[]
[]
[]
[]
[]
[null,null,"Procedura Operativa Standard (POS)",null,null,null,null,null,null,null,null,null,null,null,null,"Procedure Previste"]
[null,null,null,null,null,null,null,null,null,null,null,null,null,null,null,{"$f":"K190","v":"AIB.2.1 - SUPPORTO DOS"}]
[null,null,1,"Monitoraggio",null,null,null,null,null,null,null,null,null,null,null,"--"]
[null,null,2,"Perlustrazione",null,null,null,null,null,null,null,null,null,null,null,"--"]
[null,null,3,"Presidio Cancelli/Supporto Viabilità",null,null,null,null,null,null,null,null,null,null,null,"X"]
[null,null,4,"Informazione Diretta alla Popolazione",null,null,null,null,null,null,null,null,null,null,null,"--"]
[null,null,5,"Allestimento Area di Ricovero",null,null,null,null,null,null,null,null,null,null,null,"--"]
[null,null,6,"Allestimento Area di Ammassamento Soccorsi",null,null,null,null,null,null,null,null,null,null,null,"--"]
[null,null,7,"Evacuazione",null,null,null,null,null,null,null,null,null,null,null,"--"]
[null,null,8,"Rimozione Ostacoli",null,null,null,null,null,null,null,null,null,null,null,"--"]
[null,null,9,"Rimozione Ostacoli da Alveo",null,null,null,null,null,null,null,null,null,null,null,"--"]
[null,null,10,"Preservazione Argini",null,null,null,null,null,null,null,null,null,null,null,"--"]
[null,null,11,"Frana",null,null,null,null,null,null,null,null,null,null,null,"--"]

{"sheet":"AIB_3","index":5,"n_rows":226,"n_cols":27,"rows_kept":226,"cut":false,"hidden":false,"merged":[[189,1,189,6],[189,7,189,24],[200,1,204,6],[200,7,200,24],[201,7,201,24],[202,7,202,24],[203,7,203,24],[204,7,204,24],[205,1,206,6],[205,7,206,24],[21,1,23,9],[0,0,1,6],[0,7,1,18],[0,19,1,25],[3,0,4,22],[3,23,6,25],[5,0,6,22],[8,1,8,9],[8,10,8,24],[9,1,9,9],[9,10,9,24],[10,1,13,9],[10,10,12,24],[13,10,13,24],[14,1,18,9],[14,10,18,24],[19,1,20,9],[19,10,20,24],[21,17,23,24],[21,10,21,16],[22,10,22,16],[23,10,23,16],[145,11,145,14],[134,0,136,4],[58,10,58,24],[24,1,25,9],[24,10,25,24],[59,10,59,24],[128,0,130,4],[46,10,46,24],[131,0,133,4],[131,5,133,10],[131,11,131,14],[131,15,133,18],[131,19,131,22],[132,11,132,14],[144,5,147,10],[143,15,143,18],[137,23,139,25],[134,5,136,10],[134,11,136,14],[133,19,133,22],[128,5,130,10],[128,11,128,25],[129,11,130,14],[129,15,130,18],[152,0,152,4],[137,26,143,26],[138,11,138,14],[139,11,139,14],[140,0,141,4],[140,5,141,10],[140,11,140,14],[140,15,141,18],[140,19,141,22],[140,23,141,25],[148,11,148,14],[148,15,151,18],[148,19,151,22],[149,11,149,14],[150,11,150,14],[151,11,151,14],[144,19,144,22],[142,23,142,25],[144,11,144,14],[145,23,145,25],[148,23,148,24],[146,19,146,22],[144,15,147,18],[144,26,145,26],[129,19,130,22],[143,19,143,22],[143,23,143,25],[141,11,141,14],[142,0,142,4],[142,5,142,10],[142,11,142,14],[142,15,142,18],[142,19,142,22],[129,23,130,25],[137,0,139,4],[137,5,139,10],[143,0,143,4],[143,5,143,10],[143,11,143,14],[132,19,132,22],[133,11,133,14],[137,11,137,14],[137,15,139,18],[137,19,139,22],[131,23,131,25],[134,19,136,22],[134,23,136,25],[154,23,154,25],[148,0,151,4],[148,5,151,10],[154,26,157,26],[155,11,155,14],[156,0,156,4],[156,5,156,10],[156,11,156,14],[156,15,156,18],[156,19,156,22],[156,23,156,25],[152,5,152,10],[152,11,152,14],[152,15,152,18],[152,19,152,22],[152,23,152,25],[154,19,155,22],[146,26,153,26],[147,11,147,14],[147,19,147,22],[154,0,155,4],[154,5,155,10],[154,11,154,14],[154,15,155,18],[157,11,157,14],[157,15,157,18],[157,19,157,22],[157,23,157,25],[158,0,158,25],[159,0,162,4],[159,5,162,10],[159,11,162,14],[157,0,157,4],[157,5,157,10],[159,15,162,18],[159,19,162,22],[164,0,164,25],[160,23,160,25],[188,1,188,6],[188,7,188,24],[217,18,217,20],[217,3,217,14],[220,21,220,23],[219,15,219,17],[219,18,219,20],[219,21,219,23],[218,15,218,17],[218,18,218,20],[218,21,218,23],[217,21,217,23],[213,2,214,14],[213,15,213,23],[214,15,214,17],[214,18,214,20],[214,21,214,23],[215,15,215,17],[215,18,215,20],[215,21,215,23],[216,15,216,17],[216,18,216,20],[216,3,216,14],[207,1,208,6],[207,7,208,24],[190,1,190,6],[190,7,190,24],[191,1,194,6],[191,7,191,24],[192,7,192,24],[193,7,193,24],[194,7,194,24],[195,1,199,6],[195,7,195,24],[196,7,196,24],[197,7,197,24],[198,7,198,24],[199,7,199,24],[153,23,153,24],[218,3,218,14],[219,3,219,14],[221,18,221,20],[221,21,221,23],[222,15,222,17],[223,18,223,20],[223,21,223,23],[222,18,222,20],[222,21,222,23],[220,3,220,14],[221,3,221,14],[222,3,222,14],[223,3,223,14],[220,18,220,20],[153,19,153,22],[216,21,216,23],[217,15,217,17],[220,15,220,17],[183,0,184,22],[183,23,186,25],[185,0,186,22],[223,15,223,17],[215,3,215,14],[225,3,225,14],[224,15,224,17],[224,18,224,20],[224,21,224,23],[225,15,225,17],[225,18,225,20],[225,21,225,23],[224,3,224,14],[221,15,221,17],[26,1,28,9],[28,10,28,24],[29,1,31,9],[29,10,31,24],[46,1,48,9],[26,10,27,24],[47,10,47,24],[48,10,48,24],[32,1,35,4],[36,1,40,4],[41,1,45,4],[32,5,32,24],[33,5,33,24],[34,5,34,24],[35,5,35,24],[36,5,36,24],[37,5,37,24],[40,5,40,24],[41,5,41,24],[42,5,42,24],[43,5,43,24],[44,5,44,24],[45,5,45,24],[38,5,38,24],[39,5,39,24],[50,11,50,24],[51,11,51,24],[49,1,51,9],[49,11,49,24],[52,1,56,9],[52,10,56,24],[153,0,153,4],[153,5,153,10],[153,11,153,14],[153,15,153,18],[144,0,147,4],[146,11,146,14],[145,19,145,22],[57,1,57,9],[57,10,57,24],[58,1,59,9],[63,0,64,22],[63,23,66,25],[65,0,66,22],[123,0,124,22],[123,23,126,25],[125,0,126,22],[134,15,136,18]]}
[{"$f":"NCOM&\" (\"&PCOM&\")\"","v":"Comune di Trescore Cremasco (CR)"},null,null,null,null,null,null,{"$f":"IF(INDEX(INT,1,13)=\"\",INDEX(INT,1,1),INDEX(INT,1,13))","v":"Piano di Emergenza Intercomunale di Protezione Civile"},null,null,null,null,null,null,null,null,null,null,null,{"$f":"IF(TIPOP=\"Edizione\",\"Ed. \",IF(TIPOP=\"Revisione\",\"Rev. \",\"Bozza \"))&TIPON&\" del \"&TIPOD","v":"Ed. 01 del 04/11/2012"}]
[]
[]
["Scheda Scenario",null,null,null,null,null,null,null,null,null,null,null,null,null,null,null,null,null,null,null,null,null,null,{"$f":"_AIB3","v":"AIB.3"}]
[]
[{"$f":"IF(INDEX(AIB3PAR,1,19)=\"\",INDEX(AIB3PAR,1,12),INDEX(AIB3PAR,1,19))&\" - Fase di Emergenza\"","v":"Rischio Incendio Boschivo - Fase di Emergenza"}]
[]
[]
[null,"Paragrafi di Riferimento ",null,null,null,null,null,null,null,null,{"$f":"INDEX(AIB3PAR,1,1)&INDEX(AIB3PAR,1,12)","v":"2.2.4 - 3.3.3 Procedure per il Rischio Incendio Boschivo"}]
[null,"Codice Scheda",null,null,null,null,null,null,null,null,{"$f":"X4","v":"AIB.3"}]
[null,"Evento atteso",null,null,null,null,null,null,null,null,"Incendio in atto su aree boscate, cespugliate o arborate oppure su terreni coltivati o incolti e pascoli compresi all'interno della Fascia Perimentrale dei centri abitati."]
[]
[]
[null,null,null,null,null,null,null,null,null,null,"Evento fuori controllo che minaccia abitazioni o infrastrutture."]
[null,"Attività U.C.L.",null,null,null,null,null,null,null,null,"Supporta e collabora col D.O.S. (Direttore Operazioni di Spegnimento), agente CFS (Corpo Forestale dello Stato) o delegato Ente territorialmente competente (Parco o Provincia) che gestisce in prima persona le operazioni di spegnimento."]
[]
[]
[]
[]
[null,"Ubicazione intervento",null,null,null,null,null,null,null,null,"Aree limitrofe alla zona interessata dall'incendio boschivo, le aree urbanizzate sono quelle comprese all'interno della Zona di Interfaccia."]
[]
[null,"Personale mobilitato",null,null,null,null,null,null,null,null,{"$f":"IF(INDEX(AIB3PER,1,1)=\"\",\"\",\"- \"&VLOOKUP(INDEX(AIB3PER,1,1),Personale,IF(INDEX(Personale,INDEX(AIB3PER,1,1),14)=\"\",2,14)))","v":"- Polizia Locale"},null,null,null,null,null,null,"Riportare la composizione delle squadre nel Modulo M1"]
[null,null,null,null,null,null,null,null,null,null,{"$f":"IF(INDEX(AIB3PER,1,2)=\"\",\"\",\"- \"&VLOOKUP(INDEX(AIB3PER,1,2),Personale,IF(INDEX(Personale,INDEX(AIB3PER,1,2),14)=\"\",2,14)))","v":"- Volontari P.C."}]
[null,null,null,null,null,null,null,null,null,null,{"$f":"IF(INDEX(AIB3PER,1,3)=\"\",\"\",\"- \"&VLOOKUP(INDEX(AIB3PER,1,3),Personale,IF(INDEX(Personale,INDEX(AIB3PER,1,3),14)=\"\",2,14)))","v":"- Tecnici/Operai Comunali"}]
[null,"Attività personale mobilitato",null,null,null,null,null,null,null,null,"Supporto logistico, chiusura strade, evacuazione popolazione. "]
[]
[null,"Grado di coinvolgimento della popolazione",null,null,null,null,null,null,null,null,"Evacuazione preventiva per i residenti in prossimità di aree colpite dall'incendio all'interno della Fascia di Interfaccia."]
[]
[null,null,null,null,null,null,null,null,null,null,"Registrare le persone eventualmente evacuate nel Modulo M2"]
[null,"Cancelli e vie alternative",null,null,null,null,null,null,null,null,"Da decidersi in collaborazione con il DOS."]
[]
[]
[null,"Aree di raccolta popolazione",null,null,null,{"$f":"IF(INDEX(AIB3RIC,1,1)=\"\",\"In questa fase non è prevista l’attivazione di tali aree.\",\"Per questa emergenza \"&IF(INDEX(AIB3RIC,1,2)=\"\",\"è disponibile la seguente area:\",\"sono disponibili le seguenti aree:\"))","v":"Per questa emergenza sono disponibili le seguenti aree:"}]
[null,null,null,null,null,{"$f":"IF(INDEX(AIB3RIC,1,1)=\"\",\"\",\"- \"&VLOOKUP(INDEX(AIB3RIC,1,1),Ricovero,2))","v":"- Centro Sportivo Comunale - Carta AE.41 - Trescore Cremasco - Ricovero/Tendopoli"}]
[null,null,null,null,null,{"$f":"IF(INDEX(AIB3RIC,1,2)=\"\",\"\",\"- \"&VLOOKUP(INDEX(AIB3RIC,1,2),Ricovero,2))","v":"- Scuola Secondaria di I Grado \"Manzoni\" - Carta AE.42 - Trescore Cremasco - Ricovero"}]
[null,null,null,null,null,{"$f":"IF(INDEX(AIB3RIC,1,3)=\"\",\"\",\"- \"&VLOOKUP(INDEX(AIB3RIC,1,3),Ricovero,2))","v":"- Scuola Primaria Trescore Cremasco - Carta AE.43 - Trescore Cremasco - Ricovero"}]
[null,"Area di ricovero",null,null,null,{"$f":"IF(INDEX(AIB3RIC,1,4)=\"\",\"\",\"- \"&VLOOKUP(INDEX(AIB3RIC,1,4),Ricovero,2))","v":""}]
[null,null,null,null,null,{"$f":"IF(INDEX(AIB3RIC,1,5)=\"\",\"\",\"- \"&VLOOKUP(INDEX(AIB3RIC,1,5),Ricovero,2))","v":""}]
[null,null,null,null,null,{"$f":"IF(INDEX(AIB3RIC,1,6)=\"\",\"\",\"- \"&VLOOKUP(INDEX(AIB3RIC,1,6),Ricovero,2))","v":""}]
[null,null,null,null,null,{"$f":"IF(INDEX(AIB3RIC,1,7)=\"\",\"\",\"- \"&VLOOKUP(INDEX(AIB3RIC,1,7),Ricovero,2))","v":""}]
[null,null,null,null,null,{"$f":"IF(F35=\"\",\"\",\"In funzione della gravità della situazione si decide quali/quante aree attivare.\")","v":"In funzione della gravità della situazione si decide quali/quante aree attivare."}]
[null,"Area di raduno soccorritori",null,null,null,{"$f":"IF(INDEX(AIB3SOC,1,1)=\"\",\"In questa fase non è prevista l’attivazione di tali aree.\",\"Per questa emergenza \"&IF(INDEX(AIB3SOC,1,2)=\"\",\"è disponibile la seguente area:\",\"sono disponibili le seguenti aree:\"))","v":"Per questa emergenza sono disponibili le seguenti aree:"}]
[null,null,null,null,null,{"$f":"IF(INDEX(AIB3SOC,1,1)=\"\",\"\",\"- \"&VLOOKUP(INDEX(AIB3SOC,1,1),Soccorritori,2))","v":"- Centro Sportivo Comunale - Carte AE.41 - Trescore Cremasco - SV.41 - Aviosuperficie"}]
[null,null,null,null,null,{"$f":"IF(INDEX(AIB3SOC,1,2)=\"\",\"\",\"- \"&VLOOKUP(INDEX(AIB3SOC,1,2),Soccorritori,2))","v":"- Centro Sportivo Comunale - Carte AE.41 - Trescore Cremasco - SV.41 - Ammassamento"}]
[null,null,null,null,null,{"$f":"IF(INDEX(AIB3SOC,1,3)=\"\",\"\",\"- \"&VLOOKUP(INDEX(AIB3SOC,1,3),Soccorritori,2))","v":""}]
[null,null,null,null,null,{"$f":"IF(F44=\"\",\"\",\"In funzione della localizzazione dell'incendio boschivo si decide quale area attivare.\")","v":"In funzione della localizzazione dell'incendio boschivo si decide quale area attivare."}]
[null,"Ordinanze Necessarie",null,null,null,null,null,null,null,null,"Ordinanza di Chiusura Strade;"]
[null,null,null,null,null,null,null,null,null,null,"Ordinanza di Evacuazione."]
[]
[null,"Modalita’ Riunione U.C.L.",null,null,null,null,null,null,null,null,null,"Non necessaria"]
[null,null,null,null,null,null,null,null,null,null,"X","Virtuale"]
[null,null,null,null,null,null,null,null,null,null,null,"In sede"]
[null,"Possibili Scenari Concomitanti",null,null,null,null,null,null,null,null,"Non ragionevolmente prevedibile la concomitanza con altri eventi."]
[]
[]
[]
[]
[null,"Contatti Utili",null,null,null,null,null,null,null,null,{"$f":"\"Consultare il \"&IF([1]Maschera!Z71=\"\",[1]Maschera!N71,[1]Maschera!Z71)","v":"Consultare il Tomo Giallo - Risorse"}]
[null,"Cartografia",null,null,null,null,null,null,null,null,{"$f":"INDEX(AIB2PAR,1,28)","v":"Tav. 3/C - Rischio Viabilità - AIB - Altri Rischi"}]
[null,null,null,null,null,null,null,null,null,null,{"$f":"INDEX(AIB2PAR,1,39)","v":"Tav. 3/D - Stradario Piano di Emergenza"}]
[]
[]
[]
[{"$f":"Titolo2","v":"Procedure U.C.L."},null,null,null,null,null,null,null,null,null,null,null,null,null,null,null,null,null,null,null,null,null,null,{"$f":"_AIB3","v":"AIB.3"}]
[]
[{"$f":"$A$6","v":"Rischio Incendio Boschivo - Fase di Emergenza"}]
[]
[]
[]
[]
[]
[]
[]
[]
[]
[]
[]
[]
[]
[]
[]
[]
[]
[]
[]
[]
[]
[]
[]
[]
[]
[]
[]
[]
[]
[]
[]
[]
[]
[]
[]
[]
[]
[]
[]
[]
[]
[]
[]
[]
[]
[]
[]
[]
[]
[]
[]
[]
[]
[]
[]
[]
[]
[{"$f":"Titolo2","v":"Procedure U.C.L."},null,null,null,null,null,null,null,null,null,null,null,null,null,null,null,null,null,null,null,null,null,null,{"$f":"X4","v":"AIB.3"}]
[]
[{"$f":"$A$6","v":"Rischio Incendio Boschivo - Fase di Emergenza"}]
[]
[]
["RESPONSABILE",null,null,null,null,"AZIONE",null,null,null,null,null,"CHIAMATE"]
[null,null,null,null,null,null,null,null,null,null,null,"MEMBRO UCL",null,null,null,"OPERATIVI",null,null,null,"ENTE INTERESSATO",null,null,null,"SCHEDE CHIAMATE"]
[]
[{"$f":"IF(INDEX(Sindaco,1,9)=\"\",INDEX(Sindaco,1,1),INDEX(Sindaco,1,9))","v":"SINDACO / R.O.C."},null,null,null,null,"Avvisa della Fase di Emergenza.",null,null,null,null,null,{"$f":"\"- \"&PROPER(IF(INDEX(Sindaco,1,9)=\"\",LEFT(INDEX(Sindaco,1,1),7),INDEX(Sindaco,1,9)))","v":"- Sindaco"},null,null,null,"--",null,null,null,{"$f":"\"- \"&IF(INDEX(PR,1,9)=\"\",INDEX(PR,1,1),INDEX(PR,1,9))","v":"- Prefettura"},null,null,null,"O1 - O2"]
[null,null,null,null,null,null,null,null,null,null,null,{"$f":"\"- \"&PROPER(IF(INDEX(PL,1,9)=\"\",INDEX(PL,1,1),INDEX(PL,1,9)))","v":"- Polizia Locale"},null,null,null,null,null,null,null,{"$f":"\"- \"&IF(INDEX(PRO,1,9)=\"\",INDEX(PRO,1,1),INDEX(PRO,1,9))","v":"- Provincia"},null,null,null,"C2.1","C2.3","C2.4"]
[null,null,null,null,null,null,null,null,null,null,null,{"$f":"\"- \"&PROPER(IF(INDEX(CV,1,9)=\"\",INDEX(CV,1,1),INDEX(CV,1,9)))","v":"- C. Volontariato"},null,null,null,null,null,null,null,{"$f":"\"- \"&IF(INDEX(REG,1,9)=\"\",INDEX(REG,1,1),INDEX(REG,1,9))","v":"- Regione"}]
[{"$f":"IF(INDEX(Sindaco,1,9)=\"\",INDEX(Sindaco,1,1),INDEX(Sindaco,1,9))","v":"SINDACO / R.O.C."},null,null,null,null,"Invia il C.te della Polizia Locale, o delegato, a supporto del DOS.",null,null,null,null,null,"--",null,null,null,"--",null,null,null,"--",null,null,null,"O1 - O2"]
[]
[]
[{"$f":"IF(INDEX(Sindaco,1,9)=\"\",INDEX(Sindaco,1,1),INDEX(Sindaco,1,9))","v":"SINDACO / R.O.C."},null,null,null,null,{"$f":"\"In accordo col DOS organizza cancelli per il traffico. \"&_AIB3&\".1\"","v":"In accordo col DOS organizza cancelli per il traffico. AIB.3.1"},null,null,null,null,null,{"$f":"\"- \"&PROPER(IF(INDEX(PL,1,9)=\"\",INDEX(PL,1,1),INDEX(PL,1,9)))","v":"- Polizia Locale"},null,null,null,"--",null,null,null,"--",null,null,null,"O1 - O2",null,null,{"$f":"_AIB3&\".1\"","v":"AIB.3.1"}]
[null,null,null,null,null,null,null,null,null,null,null,{"$f":"\"- \"&PROPER(IF(INDEX(CV,1,9)=\"\",INDEX(CV,1,1),INDEX(CV,1,9)))","v":"- C. Volontariato"}]
[null,null,null,null,null,null,null,null,null,null,null,{"$f":"\"- \"&PROPER(IF(INDEX(CC,1,9)=\"\",INDEX(CC,1,1),INDEX(CC,1,9)))","v":"- C. Carabinieri"}]
[{"$f":"IF(INDEX(PL,1,9)=\"\",INDEX(PL,1,1),INDEX(PL,1,9))","v":"POLIZIA LOCALE"},null,null,null,null,{"$f":"\"Responsabile \"&_AIB3&\".1\"","v":"Responsabile AIB.3.1"},null,null,null,null,null,{"$f":"\"- \"&PROPER(IF(INDEX(CV,1,9)=\"\",INDEX(CV,1,1),INDEX(CV,1,9)))","v":"- C. Volontariato"},null,null,null,{"$f":"\"- \"&IF(INDEX(PLO,1,9)=\"\",INDEX(PLO,1,1),INDEX(PLO,1,9))","v":"- Agenti P.L."},null,null,null,"--",null,null,null,"O1 - O2  A2.2"]
[null,null,null,null,null,null,null,null,null,null,null,{"$f":"\"- \"&PROPER(IF(INDEX(CC,1,9)=\"\",INDEX(CC,1,1),INDEX(CC,1,9)))","v":"- C. Carabinieri"}]
[{"$f":"IF(INDEX(CV,1,9)=\"\",INDEX(CV,1,1),INDEX(CV,1,9))","v":"C. VOLONTARIATO"},null,null,null,null,{"$f":"\"Coadiuva \"&_AIB3&\".1\"","v":"Coadiuva AIB.3.1"},null,null,null,null,null,"--",null,null,null,{"$f":"\"- \"&IF(INDEX(VO,1,9)=\"\",INDEX(VO,1,1),INDEX(VO,1,9))","v":"- Gruppi Volontari"},null,null,null,"--",null,null,null,"A3 - B3"]
[{"$f":"IF(INDEX(CC,1,9)=\"\",INDEX(CC,1,1),INDEX(CC,1,9))","v":"C. CARABINIERI"},null,null,null,null,{"$f":"\"Coadiuva \"&_AIB3&\".1\"","v":"Coadiuva AIB.3.1"},null,null,null,null,null,"--",null,null,null,{"$f":"\"- \"&IF(INDEX(CO,1,9)=\"\",INDEX(CO,1,1),INDEX(CO,1,9))","v":"- Carabinieri"},null,null,null,"--",null,null,null,"--"]
[{"$f":"IF(INDEX(Sindaco,1,9)=\"\",INDEX(Sindaco,1,1),INDEX(Sindaco,1,9))","v":"SINDACO / R.O.C."},null,null,null,null,{"$f":"\"In accordo col DOS attiva le aree di emergenza (\"&_AIB3&\".2)\"&\" e dispone le evacuazioni (\"&_AIB3&\".3).\"","v":"In accordo col DOS attiva le aree di emergenza (AIB.3.2) e dispone le evacuazioni (AIB.3.3)."},null,null,null,null,null,null,null,null,null,"--",null,null,null,{"$f":"\"- \"&IF(INDEX(PR,1,9)=\"\",INDEX(PR,1,1),INDEX(PR,1,9))","v":"- Prefettura"}]
[null,null,null,null,null,null,null,null,null,null,null,{"$f":"\"- \"&PROPER(IF(INDEX(PL,1,9)=\"\",INDEX(PL,1,1),INDEX(PL,1,9)))","v":"- Polizia Locale"},null,null,null,null,null,null,null,{"$f":"\"- \"&IF(INDEX(PRO,1,9)=\"\",INDEX(PRO,1,1),INDEX(PRO,1,9))","v":"- Provincia"},null,null,null,"O1 - O2"]
[null,null,null,null,null,null,null,null,null,null,null,{"$f":"\"- \"&PROPER(IF(INDEX(RT,1,9)=\"\",INDEX(RT,1,1),INDEX(RT,1,9)))","v":"- Resp. Territorio"},null,null,null,null,null,null,null,{"$f":"\"- \"&IF(INDEX(REG,1,9)=\"\",INDEX(REG,1,1),INDEX(REG,1,9))","v":"- Regione"},null,null,null,"C2.1","C2.3","C2.4",{"$f":"_AIB3&\".2\"","v":"AIB.3.2"}]
[]
[{"$f":"IF(INDEX(RT,1,9)=\"\",INDEX(RT,1,1),INDEX(RT,1,9))","v":"RESP. TERRITORIO"},null,null,null,null,{"$f":"\"Responsabile \"&_AIB3&\".2\"","v":"Responsabile AIB.3.2"},null,null,null,null,null,null,null,null,null,{"$f":"\"- \"&IF(INDEX(TCO,1,9)=\"\",INDEX(TCO,1,1),INDEX(TCO,1,9))","v":"- Tecnici Comunali"},null,null,null,"--",null,null,null,"O1 - O2",null,"A2.1"]
[null,null,null,null,null,null,null,null,null,null,null,{"$f":"\"- \"&PROPER(IF(INDEX(CV,1,9)=\"\",INDEX(CV,1,1),INDEX(CV,1,9)))","v":"- C. Volontariato"},null,null,null,null,null,null,null,null,null,null,null,"A4","A5","A6"]
[null,null,null,null,null,null,null,null,null,null,null,{"$f":"\"- \"&PROPER(IF(INDEX(RSS,1,9)=\"\",INDEX(RSS,1,1),INDEX(RSS,1,9)))","v":"- Resp. Serv. Sociali"},null,null,null,null,null,null,null,null,null,null,null,"A7.1","A7.2","B5"]
[null,null,null,null,null,null,null,null,null,null,null,null,null,null,null,null,null,null,null,null,null,null,null,"B6","C1","C3"]
[{"$f":"IF(INDEX(CV,1,9)=\"\",INDEX(CV,1,1),INDEX(CV,1,9))","v":"C. VOLONTARIATO"},null,null,null,null,{"$f":"\"Coadiuva \"&_AIB3&\".2\"","v":"Coadiuva AIB.3.2"},null,null,null,null,null,"--",null,null,null,{"$f":"\"- \"&IF(INDEX(VO,1,9)=\"\",INDEX(VO,1,1),INDEX(VO,1,9))","v":"- Gruppi Volontari"},null,null,null,"--",null,null,null,"A3 - B3"]
[{"$f":"IF(INDEX(RSS,1,9)=\"\",INDEX(RSS,1,1),INDEX(RSS,1,9))","v":"RESP. SERV. SOCIALI"},null,null,null,null,{"$f":"\"Coadiuva \"&_AIB3&\".2\"","v":"Coadiuva AIB.3.2"},null,null,null,null,null,"--",null,null,null,{"$f":"\"- \"&IF(INDEX(SO,1,9)=\"\",INDEX(SO,1,1),INDEX(SO,1,9))","v":"- Pers. Sanitario"},null,null,null,"--",null,null,null,"B1 - C2.2 ",null,"D1"]
[{"$f":"IF(INDEX(PL,1,9)=\"\",INDEX(PL,1,1),INDEX(PL,1,9))","v":"POLIZIA LOCALE"},null,null,null,null,{"$f":"\"Responsabile \"&_AIB3&\".3\"","v":"Responsabile AIB.3.3"},null,null,null,null,null,{"$f":"\"- \"&PROPER(IF(INDEX(CV,1,9)=\"\",INDEX(CV,1,1),INDEX(CV,1,9)))","v":"- C. Volontariato"},null,null,null,{"$f":"\"- \"&IF(INDEX(PLO,1,9)=\"\",INDEX(PLO,1,1),INDEX(PLO,1,9))","v":"- Agenti P.L."},null,null,null,"--",null,null,null,"O1 - O2  A2.2",null,null,{"$f":"_AIB3&\".3\"","v":"AIB.3.3"}]
[null,null,null,null,null,null,null,null,null,null,null,{"$f":"\"- \"&PROPER(IF(INDEX(CC,1,9)=\"\",INDEX(CC,1,1),INDEX(CC,1,9)))","v":"- C. Carabinieri"},null,null,null,null,null,null,null,null,null,null,null,"M2","D2"]
[{"$f":"IF(INDEX(CV,1,9)=\"\",INDEX(CV,1,1),INDEX(CV,1,9))","v":"C. VOLONTARIATO"},null,null,null,null,{"$f":"\"Coadiuva \"&_AIB3&\".3\"","v":"Coadiuva AIB.3.3"},null,null,null,null,null,"--",null,null,null,{"$f":"\"- \"&IF(INDEX(VO,1,9)=\"\",INDEX(VO,1,1),INDEX(VO,1,9))","v":"- Gruppi Volontari"},null,null,null,"--",null,null,null,"A3 - B3"]
[{"$f":"IF(INDEX(CC,1,9)=\"\",INDEX(CC,1,1),INDEX(CC,1,9))","v":"C. CARABINIERI"},null,null,null,null,{"$f":"\"Coadiuva \"&_AIB3&\".3\"","v":"Coadiuva AIB.3.3"},null,null,null,null,null,"--",null,null,null,{"$f":"\"- \"&IF(INDEX(CO,1,9)=\"\",INDEX(CO,1,1),INDEX(CO,1,9))","v":"- Carabinieri"},null,null,null,"--",null,null,null,"--"]
["SE L'INCENDIO VIENE DOMATO"]
[{"$f":"IF(INDEX(Sindaco,1,9)=\"\",INDEX(Sindaco,1,1),INDEX(Sindaco,1,9))","v":"SINDACO / R.O.C."},null,null,null,null,"Avvisa della cessazione della Fase di Emergenza e dispone il rientro della popolazione.",null,null,null,null,null,"- Tutti",null,null,null,"--",null,null,null,"--"]
[null,null,null,null,null,null,null,null,null,null,null,null,null,null,null,null,null,null,null,null,null,null,null,"O1 - O2  C2.3"]
[null,null,null,null,null,null,null,null,null,null,null,null,null,null,null,null,null,null,null,null,null,null,null,"M1","M2"]
[]
[]
["PER LE COMUNICAZIONI EVIDENZIATE IN ROSSO UTILIZZARE IL MODULO FAX M4"]
[]
[]
[]
[]
[]
[]
[]
[]
[]
[]
[]
[]
[]
[]
[]
[]
[]
[]
[{"$f":"Titolo3","v":"Scheda Procedura Operativa"},null,null,null,null,null,null,null,null,null,null,null,null,null,null,null,null,null,null,null,null,null,null,{"$f":"X4","v":"AIB.3"}]
[]
[{"$f":"$A$6","v":"Rischio Incendio Boschivo - Fase di Emergenza"}]
[]
[]
[null,"Codice Scheda Scenario",null,null,null,null,null,{"$f":"X4","v":"AIB.3"}]
[null,"Tipo di Procedure",null,null,null,null,null,{"$f":"_AIB3&\".1 \"&_AIB3&\".2 \"&_AIB3&\".3 - INCENDIO DI INTERFACCIA\"","v":"AIB.3.1 AIB.3.2 AIB.3.3 - INCENDIO DI INTERFACCIA"}]
[null,"Ubicazione intervento",null,null,null,null,null," --"]
[null,"Aree di raccolta popolazione",null,null,null,null,null,{"$f":"IF(INDEX(AIB3RIC,1,1)=\"\",\"In questa fase non è prevista l’attivazione di tali aree.\",\"Per questa emergenza \"&IF(INDEX(AIB3RIC,1,2)=\"\",\"è disponibile la seguente area:\",\"sono disponibili le seguenti aree:\"))","v":"Per questa emergenza sono disponibili le seguenti aree:"}]
[null,null,null,null,null,null,null,{"$f":"IF(INDEX(AIB3RIC,1,1)=\"\",\"\",\"- \"&VLOOKUP(INDEX(AIB3RIC,1,1),Ricovero,2))","v":"- Centro Sportivo Comunale - Carta AE.41 - Trescore Cremasco - Ricovero/Tendopoli"}]
[null,null,null,null,null,null,null,{"$f":"IF(INDEX(AIB3RIC,1,2)=\"\",\"\",\"- \"&VLOOKUP(INDEX(AIB3RIC,1,2),Ricovero,2))","v":"- Scuola Secondaria di I Grado \"Manzoni\" - Carta AE.42 - Trescore Cremasco - Ricovero"}]
[null,null,null,null,null,null,null,{"$f":"IF(INDEX(AIB3RIC,1,3)=\"\",\"\",\"- \"&VLOOKUP(INDEX(AIB3RIC,1,3),Ricovero,2))","v":"- Scuola Primaria Trescore Cremasco - Carta AE.43 - Trescore Cremasco - Ricovero"}]
[null,"Area di ricovero",null,null,null,null,null,{"$f":"IF(INDEX(AIB3RIC,1,4)=\"\",\"\",\"- \"&VLOOKUP(INDEX(AIB3RIC,1,4),Ricovero,2))","v":""}]
[null,null,null,null,null,null,null,{"$f":"IF(INDEX(AIB3RIC,1,5)=\"\",\"\",\"- \"&VLOOKUP(INDEX(AIB3RIC,1,5),Ricovero,2))","v":""}]
[null,null,null,null,null,null,null,{"$f":"IF(INDEX(AIB3RIC,1,6)=\"\",\"\",\"- \"&VLOOKUP(INDEX(AIB3RIC,1,6),Ricovero,2))","v":""}]
[null,null,null,null,null,null,null,{"$f":"IF(INDEX(AIB3RIC,1,7)=\"\",\"\",\"- \"&VLOOKUP(INDEX(AIB3RIC,1,7),Ricovero,2))","v":""}]
[null,null,null,null,null,null,null,{"$f":"IF(H194=\"\",\"\",\"In funzione della gravità della situazione si decide quali/quante aree attivare.\")","v":"In funzione della gravità della situazione si decide quali/quante aree attivare."}]
[null,"Area di raduno soccorritori",null,null,null,null,null,{"$f":"IF(INDEX(AIB3SOC,1,1)=\"\",\"In questa fase non è prevista l’attivazione di tali aree.\",\"Per questa emergenza \"&IF(INDEX(AIB3SOC,1,2)=\"\",\"è disponibile la seguente area:\",\"sono disponibili le seguenti aree:\"))","v":"Per questa emergenza sono disponibili le seguenti aree:"}]
[null,null,null,null,null,null,null,{"$f":"IF(INDEX(AIB3SOC,1,1)=\"\",\"\",\"- \"&VLOOKUP(INDEX(AIB3SOC,1,1),Soccorritori,2))","v":"- Centro Sportivo Comunale - Carte AE.41 - Trescore Cremasco - SV.41 - Aviosuperficie"}]
[null,null,null,null,null,null,null,{"$f":"IF(INDEX(AIB3SOC,1,2)=\"\",\"\",\"- \"&VLOOKUP(INDEX(AIB3SOC,1,2),Soccorritori,2))","v":"- Centro Sportivo Comunale - Carte AE.41 - Trescore Cremasco - SV.41 - Ammassamento"}]
[null,null,null,null,null,null,null,{"$f":"IF(INDEX(AIB3SOC,1,3)=\"\",\"\",\"- \"&VLOOKUP(INDEX(AIB3SOC,1,3),Soccorritori,2))","v":""}]
[null,null,null,null,null,null,null,{"$f":"IF(H203=\"\",\"\",\"In funzione della gravità della situazione si decide quali/quante aree attivare.\")","v":"In funzione della gravità della situazione si decide quali/quante aree attivare."}]
[null,"Cancelli e vie alternative",null,null,null,null,null," --"]
[]
[null,"Contatti Utili",null,null,null,null,null,"Si faccia riferimento al PRONTUARIO DI EMERGENZA - CONTATTI"]
[]
[]
[]
[]
[]
[null,null,"Procedura Operativa Standard (POS)",null,null,null,null,null,null,null,null,null,null,null,null,"Procedure Previste"]
[null,null,null,null,null,null,null,null,null,null,null,null,null,null,null,{"$f":"MID(H190,1,7)","v":"AIB.3.1"},null,null,{"$f":"MID(H190,9,7)","v":"AIB.3.2"},null,null,{"$f":"MID(H190,16,8)","v":" AIB.3.3"}]
[null,null,1,"Monitoraggio",null,null,null,null,null,null,null,null,null,null,null,"--",null,null,"--",null,null,"--"]
[null,null,2,"Perlustrazione",null,null,null,null,null,null,null,null,null,null,null,"--",null,null,"--",null,null,"--"]
[null,null,3,"Presidio Cancelli/Supporto Viabilità",null,null,null,null,null,null,null,null,null,null,null,"X",null,null,"--",null,null,"--"]
[null,null,4,"Informazione Diretta alla Popolazione",null,null,null,null,null,null,null,null,null,null,null,"X",null,null,"--",null,null,"--"]
[null,null,5,"Allestimento Area di Ricovero",null,null,null,null,null,null,null,null,null,null,null,"--",null,null,"X",null,null,"--"]
[null,null,6,"Allestimento Area di Ammassamento Soccorsi",null,null,null,null,null,null,null,null,null,null,null,"--",null,null,"--",null,null,"--"]
[null,null,7,"Evacuazione",null,null,null,null,null,null,null,null,null,null,null,"--",null,null,"--",null,null,"X"]
[null,null,8,"Rimozione Ostacoli",null,null,null,null,null,null,null,null,null,null,null,"--",null,null,"--",null,null,"--"]
[null,null,9,"Rimozione Ostacoli da Alveo",null,null,null,null,null,null,null,null,null,null,null,"--",null,null,"--",null,null,"--"]
[null,null,10,"Preservazione Argini",null,null,null,null,null,null,null,null,null,null,null,"--",null,null,"--",null,null,"--"]
[null,null,11,"Frana",null,null,null,null,null,null,null,null,null,null,null,"--",null,null,"--",null,null,"--"]

{"sheet":"RS_2","index":6,"n_rows":222,"n_cols":27,"rows_kept":222,"cut":false,"hidden":false,"merged":[[10,1,17,9],[10,10,17,24],[18,1,21,9],[18,10,21,24],[22,1,22,9],[22,10,22,24],[23,1,25,9],[9,10,9,24],[0,0,1,6],[0,7,1,18],[0,19,1,25],[3,0,4,22],[3,23,6,25],[5,0,6,22],[8,1,8,9],[8,10,8,24],[9,1,9,9],[23,17,25,24],[23,10,23,16],[24,10,24,16],[25,10,25,16],[48,10,48,24],[26,1,30,9],[26,10,30,24],[31,1,35,9],[31,10,35,24],[36,1,38,9],[36,10,38,24],[39,1,41,9],[39,10,39,24],[40,10,40,24],[41,10,41,24],[42,1,44,9],[42,10,42,24],[43,10,43,24],[44,10,44,24],[45,1,48,9],[45,10,45,24],[46,10,46,24],[47,10,47,24],[49,10,49,24],[50,10,50,24],[54,1,58,9],[54,10,58,24],[59,1,59,9],[59,10,59,24],[123,0,124,22],[123,23,126,25],[125,0,126,22],[60,1,61,9],[51,1,53,9],[51,11,51,24],[52,11,52,24],[53,11,53,24],[49,1,50,9],[60,10,60,24],[61,10,61,24],[63,0,64,22],[63,23,66,25],[65,0,66,22],[131,0,133,4],[131,5,133,10],[131,11,133,14],[131,15,133,18],[131,19,133,22],[131,23,133,25],[128,0,130,4],[128,5,130,10],[128,11,128,25],[129,11,130,14],[129,15,130,18],[129,19,130,22],[129,23,130,25],[143,19,143,22],[144,19,144,22],[134,0,137,4],[134,5,137,10],[134,11,137,14],[134,19,137,22],[134,23,137,25],[135,15,135,18],[136,15,136,18],[140,0,140,4],[140,5,140,10],[140,11,140,14],[140,15,140,18],[140,19,140,22],[152,19,155,22],[154,15,154,18],[147,19,150,22],[146,0,146,25],[138,23,138,25],[139,0,139,4],[139,5,139,10],[139,11,139,14],[139,15,139,18],[139,19,139,22],[139,23,139,25],[145,19,145,22],[138,0,138,4],[138,5,138,10],[138,11,138,14],[138,15,138,18],[138,19,138,22],[140,23,140,25],[141,0,141,25],[142,0,145,4],[142,5,145,10],[142,11,145,14],[142,15,145,18],[142,19,142,22],[188,1,188,9],[188,10,188,24],[191,1,193,9],[191,10,191,24],[192,10,192,24],[193,10,193,24],[159,19,159,22],[147,26,155,26],[151,0,151,4],[151,5,151,10],[151,11,151,14],[151,15,151,18],[151,19,151,22],[151,23,151,25],[152,0,155,4],[158,19,158,22],[147,23,150,25],[160,19,160,22],[147,0,150,4],[147,5,150,10],[147,11,150,14],[147,15,150,18],[152,5,155,10],[152,11,155,14],[156,0,156,25],[157,0,160,4],[157,5,160,10],[157,11,160,14],[157,15,160,18],[157,19,157,22],[183,0,184,22],[183,23,186,25],[185,0,186,22],[166,0,166,25],[161,0,161,25],[162,0,164,4],[162,5,164,10],[162,11,164,14],[162,15,164,18],[162,19,164,22],[162,23,164,25],[219,3,219,14],[220,3,220,14],[221,3,221,14],[158,23,158,25],[211,3,211,14],[212,3,212,14],[213,3,213,14],[214,3,214,14],[217,15,217,23],[221,15,221,23],[218,15,218,23],[219,15,219,23],[220,15,220,23],[212,15,212,23],[213,15,213,23],[214,15,214,23],[215,15,215,23],[216,15,216,23],[201,1,201,9],[201,10,201,24],[209,2,210,14],[209,15,209,23],[210,15,210,23],[211,15,211,23],[216,3,216,14],[217,3,217,14],[218,3,218,14],[202,1,204,9],[202,10,204,24],[197,1,200,9],[197,10,197,24],[198,10,198,24],[199,10,199,24],[200,10,200,24],[194,1,196,9],[194,10,194,24],[195,10,195,24],[196,10,196,24],[189,1,189,9],[189,10,189,24],[190,1,190,9],[190,10,190,24],[215,3,215,14]]}
[{"$f":"NCOM&\" (\"&PCOM&\")\"","v":"Comune di Trescore Cremasco (CR)"},null,null,null,null,null,null,{"$f":"IF(INDEX(INT,1,13)=\"\",INDEX(INT,1,1),INDEX(INT,1,13))","v":"Piano di Emergenza Intercomunale di Protezione Civile"},null,null,null,null,null,null,null,null,null,null,null,{"$f":"IF(TIPOP=\"Edizione\",\"Ed. \",IF(TIPOP=\"Revisione\",\"Rev. \",\"Bozza \"))&TIPON&\" del \"&TIPOD","v":"Ed. 01 del 04/11/2012"}]
[]
[]
["Scheda Scenario",null,null,null,null,null,null,null,null,null,null,null,null,null,null,null,null,null,null,null,null,null,null,{"$f":"_RT2","v":"RS.2"}]
[]
[{"$f":"IF(INDEX(RT2PAR,1,19)=\"\",INDEX(RT2PAR,1,12),INDEX(RT2PAR,1,19))&\" - Fase di Allarme\"","v":"Rischio Sismico - Fase di Allarme"}]
[]
[]
[null,"Paragrafi di Riferimento ",null,null,null,null,null,null,null,null,{"$f":"INDEX(RT2PAR,1,1)&INDEX(RT2PAR,1,12)","v":"2.2.3 - 3.2.7 Procedure per il Rischio Sismico"}]
[null,"Codice Scheda",null,null,null,null,null,null,null,null,{"$f":"X4","v":"RS.2"}]
[null,"Evento atteso",null,null,null,null,null,null,null,null,"Evento sismico di intensità tale da essere avvertito dalla popolazione. In caso di terremoto di bassa magnitudo i danni possono essere causati in strutture in cattivo stato di manutenzione o in luoghi del territorio che causano amplificazione locale delle onde sismiche. In caso di magnitudo più elevata il danno risulta più esteso, con danni maggiori nei luoghi più vicini all'epicentro. In questa fase non si è a conoscenza di danni nel territorio causati dal sisma."]
[]
[]
[]
[]
[]
[]
[]
[null,"Attività U.C.L.",null,null,null,null,null,null,null,null,"Controlla le capacità operative delle strutture comunali di PC e verifica la consistenza dei danni sul territorio comunale ad abitazioni, vie di comunicazione e strutture di servizi."]
[]
[]
[]
[null,"Ubicazione intervento",null,null,null,null,null,null,null,null,"Intero territorio comunale"]
[null,"Personale mobilitato",null,null,null,null,null,null,null,null,{"$f":"IF(INDEX(RT2PER,1,1)=\"\",\"\",\"- \"&VLOOKUP(INDEX(RT2PER,1,1),Personale,IF(INDEX(Personale,INDEX(RT2PER,1,1),14)=\"\",2,14)))","v":"- Polizia Locale"},null,null,null,null,null,null,"Riportare la composizione delle squadre nel Modulo M1"]
[null,null,null,null,null,null,null,null,null,null,{"$f":"IF(INDEX(RT2PER,1,2)=\"\",\"\",\"- \"&VLOOKUP(INDEX(RT2PER,1,2),Personale,IF(INDEX(Personale,INDEX(RT2PER,1,2),14)=\"\",2,14)))","v":"- Volontari P.C."}]
[null,null,null,null,null,null,null,null,null,null,{"$f":"IF(INDEX(RT2PER,1,3)=\"\",\"\",\"- \"&VLOOKUP(INDEX(RT2PER,1,3),Personale,IF(INDEX(Personale,INDEX(RT2PER,1,3),14)=\"\",2,14)))","v":"- Tecnici/Operai Comunali"}]
[null,"Attività personale mobilitato",null,null,null,null,null,null,null,null,"Tecnici ed Operai Comunali verificano l'integrità delle strutture comunali necessarie alla gestione dell'emergenza. Polizia Locale e Volontariato si occupano di verificare i danni sul territorio e di informare la popolazione dell'accaduto."]
[]
[]
[]
[]
[null,"Grado di coinvolgimento della popolazione",null,null,null,null,null,null,null,null,"Strettamente legato alla magnitudo del sisma. Si può andare da un sostanziale nulla di fatto a gravi danni alle abitazioni che costringono più o meno ampie porzioni di popolazione ad abbandonare le case per periodi di tempo anche lunghi."]
[]
[]
[]
[]
[null,"Cancelli e vie alternative",null,null,null,null,null,null,null,null,"Non è prevista in questa fase la predisposizione di cancelli per il controllo del traffico."]
[]
[]
[null,"Aree di raccolta popolazione",null,null,null,null,null,null,null,null,{"$f":"IF(INDEX(RT2RIC,1,1)=\"\",\"In questa fase non è prevista l’attivazione di tali aree.\",\"Per questa emergenza \"&IF(INDEX(RT2RIC,1,2)=\"\",\"è disponibile la seguente area:\",\"sono disponibili le seguenti aree:\"))","v":"In questa fase non è prevista l’attivazione di tali aree."}]
[null,null,null,null,null,null,null,null,null,null,{"$f":"IF(INDEX(RT2RIC,1,1)=\"\",\"\",\"- \"&VLOOKUP(INDEX(RT2RIC,1,1),Ricovero,2))","v":""}]
[null,null,null,null,null,null,null,null,null,null,{"$f":"IF(INDEX(RT2RIC,1,2)=\"\",\"\",\"- \"&VLOOKUP(INDEX(RT2RIC,1,2),Ricovero,2))","v":""}]
[null,"Area di ricovero",null,null,null,null,null,null,null,null,{"$f":"IF(INDEX(RT2RIC,1,3)=\"\",\"\",\"- \"&VLOOKUP(INDEX(RT2RIC,1,3),Ricovero,2))","v":""}]
[null,null,null,null,null,null,null,null,null,null,{"$f":"IF(INDEX(RT2RIC,1,4)=\"\",\"\",\"- \"&VLOOKUP(INDEX(RT2RIC,1,4),Ricovero,2))","v":""}]
[null,null,null,null,null,null,null,null,null,null,{"$f":"IF(K42=\"\",\"\",\"In funzione della gravità della situazione si decide quali/quante aree attivare.\")","v":""}]
[null,"Area di raduno soccorritori",null,null,null,null,null,null,null,null,{"$f":"IF(INDEX(RT2SOC,1,1)=\"\",\"In questa fase non è prevista l’attivazione di tali aree.\",\"Per questa emergenza \"&IF(INDEX(RT2SOC,1,2)=\"\",\"è disponibile la seguente area:\",\"sono disponibili le seguenti aree:\"))","v":"In questa fase non è prevista l’attivazione di tali aree."}]
[null,null,null,null,null,null,null,null,null,null,{"$f":"IF(INDEX(RT2SOC,1,1)=\"\",\"\",\"- \"&VLOOKUP(INDEX(RT2SOC,1,1),Soccorritori,2))","v":""}]
[null,null,null,null,null,null,null,null,null,null,{"$f":"IF(INDEX(RT2SOC,1,2)=\"\",\"\",\"- \"&VLOOKUP(INDEX(RT2SOC,1,2),Soccorritori,2))","v":""}]
[null,null,null,null,null,null,null,null,null,null,{"$f":"IF(K47=\"\",\"\",\"In funzione della gravità della situazione si decide quali/quante aree attivare.\")","v":""}]
[null,"Ordinanze Necessarie"]
[]
[null,"Modalita’ Riunione U.C.L.",null,null,null,null,null,null,null,null,null,"Non necessaria"]
[null,null,null,null,null,null,null,null,null,null,"X","Virtuale"]
[null,null,null,null,null,null,null,null,null,null,"X","In sede"]
[null,"Possibili Scenari Concomitanti",null,null,null,null,null,null,null,null,"Non ragionevolmente prevedibile la concomitanza con altri eventi."]
[]
[]
[]
[]
[null,"Contatti Utili",null,null,null,null,null,null,null,null,{"$f":"\"Consultare il \"&IF([1]Maschera!Z71=\"\",[1]Maschera!N71,[1]Maschera!Z71)","v":"Consultare il Tomo Giallo - Risorse"}]
[null,"Cartografia",null,null,null,null,null,null,null,null,{"$f":"INDEX(RT2PAR,1,28)","v":"Tav. 3/C - Rischio Viabilità - AIB - Altri Rischi"}]
[null,null,null,null,null,null,null,null,null,null,{"$f":"INDEX(RT2PAR,1,39)","v":"Tav. 3/D - Stradario Piano di Emergenza"}]
[]
[{"$f":"Titolo2","v":"Procedure U.C.L."},null,null,null,null,null,null,null,null,null,null,null,null,null,null,null,null,null,null,null,null,null,null,{"$f":"_RT2","v":"RS.2"}]
[]
[{"$f":"$A$6","v":"Rischio Sismico - Fase di Allarme"}]
[]
[]
[]
[]
[]
[]
[]
[]
[]
[]
[]
[]
[]
[]
[]
[]
[]
[]
[]
[]
[]
[]
[]
[]
[]
[]
[]
[]
[]
[]
[]
[]
[]
[]
[]
[]
[]
[]
[]
[]
[]
[]
[]
[]
[]
[]
[]
[]
[]
[]
[]
[]
[]
[]
[]
[]
[]
[{"$f":"Titolo2","v":"Procedure U.C.L."},null,null,null,null,null,null,null,null,null,null,null,null,null,null,null,null,null,null,null,null,null,null,{"$f":"X4","v":"RS.2"}]
[]
[{"$f":"$A$6","v":"Rischio Sismico - Fase di Allarme"}]
[]
[]
["RESPONSABILE",null,null,null,null,"AZIONE",null,null,null,null,null,"CHIAMATE"]
[null,null,null,null,null,null,null,null,null,null,null,"MEMBRO UCL",null,null,null,"OPERATIVI",null,null,null,"ENTE INTERESSATO",null,null,null,"SCHEDE RISORSE"]
[]
["SINDACO / R.O.C.",null,null,null,null,"A evento concluso si informa sull'operatività delle strutture Comunali di PC.",null,null,null,null,null,"- Tutti",null,null,null,"--",null,null,null,"--",null,null,null,"O1 - O2"]
[]
[]
[{"$f":"IF(INDEX(RT,1,9)=\"\",INDEX(RT,1,1),INDEX(RT,1,9))","v":"RESP. TERRITORIO"},null,null,null,null,"Verifica l'integrità delle strutture comunali di accoglienza e ricovero e della Sala Operativa",null,null,null,null,null,"--",null,null,null,null,null,null,null,"--",null,null,null,"A2.1 - A2.3"]
[null,null,null,null,null,null,null,null,null,null,null,null,null,null,null,{"$f":"\"- \"&IF(INDEX(TCO,1,9)=\"\",INDEX(TCO,1,1),INDEX(TCO,1,9))","v":"- Tecnici Comunali"}]
[null,null,null,null,null,null,null,null,null,null,null,null,null,null,null,{"$f":"\"- \"&IF(INDEX(OP,1,9)=\"\",INDEX(OP,1,1),INDEX(OP,1,9))","v":"- Operai"}]
[]
[{"$f":"IF(INDEX(PL,1,9)=\"\",INDEX(PL,1,1),INDEX(PL,1,9))","v":"POLIZIA LOCALE"},null,null,null,null,"Verifica l'operatività",null,null,null,null,null,"--",null,null,null,{"$f":"\"- \"&IF(INDEX(PLO,1,9)=\"\",INDEX(PLO,1,1),INDEX(PLO,1,9))","v":"- Agenti P.L."},null,null,null,"--",null,null,null,"A2.2"]
[{"$f":"IF(INDEX(CV,1,9)=\"\",INDEX(CV,1,1),INDEX(CV,1,9))","v":"C. VOLONTARIATO"},null,null,null,null,"Verifica l'operatività",null,null,null,null,null,"--",null,null,null,{"$f":"\"- \"&IF(INDEX(VO,1,9)=\"\",INDEX(VO,1,1),INDEX(VO,1,9))","v":"- Gruppi Volontari"},null,null,null,"--",null,null,null,"A4 - B3"]
[{"$f":"IF(INDEX(CC,1,9)=\"\",INDEX(CC,1,1),INDEX(CC,1,9))","v":"C. CARABINIERI"},null,null,null,null,"Verifica l'operatività",null,null,null,null,null,"--",null,null,null,{"$f":"\"- \"&IF(INDEX(CO,1,9)=\"\",INDEX(CO,1,1),INDEX(CO,1,9))","v":"- Carabinieri"},null,null,null,"--",null,null,null,"--"]
["SE DA VERIFICA RISULTA CHE L'OPERATIVITA' DELLE STRUTTURE COMUNALI E' COMPROMESSA"]
[{"$f":"IF(INDEX(Sindaco,1,9)=\"\",INDEX(Sindaco,1,1),INDEX(Sindaco,1,9))","v":"SINDACO / R.O.C."},null,null,null,null,"Informa gli Enti sovraordinati dell'impossibilità di soccorrere la popolazione",null,null,null,null,null,"--",null,null,null,"--",null,null,null,{"$f":"\"- \"&IF(INDEX(PR,1,9)=\"\",INDEX(PR,1,1),INDEX(PR,1,9))","v":"- Prefettura"}]
[null,null,null,null,null,null,null,null,null,null,null,null,null,null,null,null,null,null,null,{"$f":"\"- \"&IF(INDEX(PRO,1,9)=\"\",INDEX(PRO,1,1),INDEX(PRO,1,9))","v":"- Provincia"}]
[null,null,null,null,null,null,null,null,null,null,null,null,null,null,null,null,null,null,null,{"$f":"\"- \"&IF(INDEX(REG,1,9)=\"\",INDEX(REG,1,1),INDEX(REG,1,9))","v":"- Regione"},null,null,null,"C2.1","C2.3","C2.4"]
[null,null,null,null,null,null,null,null,null,null,null,null,null,null,null,null,null,null,null,{"$f":"\"- \"&IF(INDEX(STER,1,9)=\"\",INDEX(STER,1,1),INDEX(STER,1,9))","v":"- STER"}]
["SE DA VERIFICA CHE LE STRUTTURE COMUNALI SONO OPERATIVE"]
["POLIZIA LOCALE",null,null,null,null,{"$f":"\"Organizza la verifica dei danni sul territorio ed informa la popolazione. \"&_RT2&\".1\"","v":"Organizza la verifica dei danni sul territorio ed informa la popolazione. RS.2.1"},null,null,null,null,null,"--",null,null,null,"- Agenti P.L.",null,null,null,"--",null,null,null,"A2.2",null,null,{"$f":"_RT2&\".1\"","v":"RS.2.1"}]
[]
[]
[]
[{"$f":"IF(INDEX(CV,1,9)=\"\",INDEX(CV,1,1),INDEX(CV,1,9))","v":"C. VOLONTARIATO"},null,null,null,null,{"$f":"\"Coadiuva \"&_RT2&\".1\"","v":"Coadiuva RS.2.1"},null,null,null,null,null,"--",null,null,null,{"$f":"\"- \"&IF(INDEX(VO,1,9)=\"\",INDEX(VO,1,1),INDEX(VO,1,9))","v":"- Gruppi Volontari"},null,null,null,"--",null,null,null,"A3 - B3"]
[{"$f":"IF(INDEX(RT,1,9)=\"\",INDEX(RT,1,1),INDEX(RT,1,9))","v":"RESP. TERRITORIO"},null,null,null,null,{"$f":"\"Coadiuva nella verifica per i soli aspetti di danni a infrastrutture di servizi \"&_RT2&\".1\"","v":"Coadiuva nella verifica per i soli aspetti di danni a infrastrutture di servizi RS.2.1"},null,null,null,null,null,"--",null,null,null,null,null,null,null,"--",null,null,null,"A2.1 ","A2.3","A4"]
[null,null,null,null,null,null,null,null,null,null,null,null,null,null,null,{"$f":"\"- \"&IF(INDEX(TCO,1,9)=\"\",INDEX(TCO,1,1),INDEX(TCO,1,9))","v":"- Tecnici Comunali"},null,null,null,null,null,null,null,"A5","A6","A7.1"]
[null,null,null,null,null,null,null,null,null,null,null,null,null,null,null,{"$f":"\"- \"&IF(INDEX(OP,1,9)=\"\",INDEX(OP,1,1),INDEX(OP,1,9))","v":"- Operai"},null,null,null,null,null,null,null,"A7.2","A8","B5"]
[null,null,null,null,null,null,null,null,null,null,null,null,null,null,null,null,null,null,null,null,null,null,null,"B6","C1"]
["SE DA VERIFICA RISULTANO DANNI AD EDIFICI E/O COINVOLGIMENTO DELLA POPOLAZIONE"]
[{"$f":"IF(INDEX(Sindaco,1,9)=\"\",INDEX(Sindaco,1,1),INDEX(Sindaco,1,9))","v":"SINDACO / R.O.C."},null,null,null,null,"Attiva la Fase di Emergenza ed informa gli Enti sovraordinati ",null,null,null,null,null,"- Tutti",null,null,null,"--",null,null,null,{"$f":"\"- \"&IF(INDEX(PR,1,9)=\"\",INDEX(PR,1,1),INDEX(PR,1,9))","v":"- Prefettura"}]
[null,null,null,null,null,null,null,null,null,null,null,null,null,null,null,null,null,null,null,{"$f":"\"- \"&IF(INDEX(PRO,1,9)=\"\",INDEX(PRO,1,1),INDEX(PRO,1,9))","v":"- Provincia"},null,null,null,"O1 - O2"]
[null,null,null,null,null,null,null,null,null,null,null,null,null,null,null,null,null,null,null,{"$f":"\"- \"&IF(INDEX(REG,1,9)=\"\",INDEX(REG,1,1),INDEX(REG,1,9))","v":"- Regione"},null,null,null,"C2.1","C2.3","C2.4"]
[null,null,null,null,null,null,null,null,null,null,null,null,null,null,null,null,null,null,null,{"$f":"\"- \"&IF(INDEX(STER,1,9)=\"\",INDEX(STER,1,1),INDEX(STER,1,9))","v":"- STER"}]
["SE DA VERIFICA NON RISULTANO DANNI AD EDIFICI E/O COINVOLGIMENTO DELLA POPOLAZIONE"]
["SINDACO / R.O.C.",null,null,null,null,"Revoca la Fase di Allarme e  dispone il rientro delle squadre.",null,null,null,null,null,"--",null,null,null,"- Squadre Operativi",null,null,null,"--",null,null,null,"M1"]
[]
[]
[]
["PER LE COMUNICAZIONI EVIDENZIATE IN ROSSO UTILIZZARE IL MODULO FAX M4"]
[]
[]
[]
[]
[]
[]
[]
[]
[]
[]
[]
[]
[]
[]
[]
[]
[{"$f":"Titolo3","v":"Scheda Procedura Operativa"},null,null,null,null,null,null,null,null,null,null,null,null,null,null,null,null,null,null,null,null,null,null,{"$f":"X4","v":"RS.2"}]
[]
[{"$f":"$A$6","v":"Rischio Sismico - Fase di Allarme"}]
[]
[]
[null,"Codice Scheda Scenario",null,null,null,null,null,null,null,null,{"$f":"X4","v":"RS.2"}]
[null,"Tipo di Procedure",null,null,null,null,null,null,null,null,{"$f":"_RT2&\".1 - FASE DI ALLARME\"","v":"RS.2.1 - FASE DI ALLARME"}]
[null,"Ubicazione intervento",null,null,null,null,null,null,null,null,"Intero territorio comunale"]
[null,"Aree di raccolta popolazione",null,null,null,null,null,null,null,null,{"$f":"K40","v":"In questa fase non è prevista l’attivazione di tali aree."}]
[null,null,null,null,null,null,null,null,null,null,""]
[null,null,null,null,null,null,null,null,null,null,""]
[null,"Area di ricovero",null,null,null,null,null,null,null,null,""]
[null,null,null,null,null,null,null,null,null,null,""]
[null,null,null,null,null,null,null,null,null,null,""]
[null,"Area di raduno soccorritori",null,null,null,null,null,null,null,null,"In questa fase non è prevista l’attivazione di tali aree."]
[null,null,null,null,null,null,null,null,null,null,""]
[null,null,null,null,null,null,null,null,null,null,""]
[null,null,null,null,null,null,null,null,null,null,""]
[null,"Cancelli e vie alternative",null,null,null,null,null,null,null,null," --"]
[null,"Contatti Utili",null,null,null,null,null,null,null,null,"Si faccia riferimento al PRONTUARIO DI EMERGENZA - CONTATTI"]
[]
[]
[]
[]
[]
[]
[null,null,"Procedura Operativa Standard (POS)",null,null,null,null,null,null,null,null,null,null,null,null,"Procedure Previste"]
[null,null,null,null,null,null,null,null,null,null,null,null,null,null,null,{"$f":"MID(K190,1,6)","v":"RS.2.1"}]
[null,null,1,"Monitoraggio",null,null,null,null,null,null,null,null,null,null,null,"--"]
[null,null,2,"Perlustrazione",null,null,null,null,null,null,null,null,null,null,null,"X"]
[null,null,3,"Presidio Cancelli/Supporto Viabilità",null,null,null,null,null,null,null,null,null,null,null,"--"]
[null,null,4,"Informazione Diretta alla Popolazione",null,null,null,null,null,null,null,null,null,null,null,"X"]
[null,null,5,"Allestimento Area di Ricovero",null,null,null,null,null,null,null,null,null,null,null,"--"]
[null,null,6,"Allestimento Area di Ammassamento Soccorsi",null,null,null,null,null,null,null,null,null,null,null,"--"]
[null,null,7,"Evacuazione",null,null,null,null,null,null,null,null,null,null,null,"--"]
[null,null,8,"Rimozione Ostacoli",null,null,null,null,null,null,null,null,null,null,null,"--"]
[null,null,9,"Rimozione Ostacoli da Alveo",null,null,null,null,null,null,null,null,null,null,null,"--"]
[null,null,10,"Preservazione Argini",null,null,null,null,null,null,null,null,null,null,null,"--"]
[null,null,11,"Frana",null,null,null,null,null,null,null,null,null,null,null,"--"]

{"sheet":"RS_3","index":7,"n_rows":226,"n_cols":27,"rows_kept":226,"cut":false,"hidden":false,"merged":[[60,1,61,9],[60,10,60,24],[61,10,61,24],[123,0,124,22],[188,1,188,6],[188,7,188,24],[189,1,189,6],[189,7,189,24],[190,1,190,6],[190,7,190,24],[123,23,126,25],[125,0,126,22],[63,0,64,22],[63,23,66,25],[65,0,66,22],[128,0,130,4],[128,5,130,10],[128,11,128,25],[129,11,130,14],[129,15,130,18],[129,19,130,22],[129,23,130,25],[146,5,146,10],[146,11,146,14],[191,1,194,6],[191,7,191,24],[192,7,192,24],[193,7,193,24],[194,7,194,24],[41,1,45,4],[56,1,58,9],[56,10,58,24],[59,1,59,9],[59,10,59,24],[53,1,55,9],[53,11,53,24],[54,11,54,24],[55,11,55,24],[51,1,52,9],[51,10,51,24],[52,10,52,24],[41,5,41,24],[42,5,42,24],[43,5,43,24],[44,5,44,24],[45,5,45,24],[46,1,50,4],[46,5,46,24],[47,5,47,24],[48,5,48,24],[49,5,49,24],[50,5,50,24],[25,1,26,9],[25,10,26,24],[10,1,17,9],[27,1,31,9],[32,1,36,9],[32,10,36,24],[27,10,30,24],[31,10,31,24],[37,1,40,4],[37,5,37,24],[38,5,38,24],[39,5,39,24],[40,5,40,24],[0,0,1,6],[0,7,1,18],[0,19,1,25],[3,0,4,22],[3,23,6,25],[22,1,24,9],[9,10,9,24],[5,0,6,22],[18,1,20,9],[18,10,20,24],[21,1,21,9],[8,1,8,9],[8,10,8,24],[9,1,9,9],[10,10,17,24],[21,10,21,24],[22,17,24,24],[22,10,22,16],[23,10,23,16],[24,10,24,16],[141,11,141,14],[141,15,141,18],[142,15,142,18],[143,15,143,18],[131,0,131,25],[132,0,139,4],[132,5,139,10],[132,19,139,22],[144,0,145,4],[144,5,145,10],[144,11,144,14],[144,15,145,18],[135,23,135,25],[140,23,140,24],[148,0,152,4],[148,5,152,10],[148,15,152,18],[132,26,147,26],[140,0,143,4],[140,5,143,10],[140,19,143,22],[146,15,146,18],[146,19,146,22],[146,23,146,25],[147,0,147,4],[147,5,147,10],[147,11,147,14],[147,15,147,18],[147,19,147,22],[147,23,147,25],[144,19,145,22],[144,23,145,25],[145,11,145,14],[146,0,146,4],[148,26,158,26],[149,11,149,14],[149,23,149,25],[151,11,151,14],[153,23,153,24],[159,15,160,18],[159,19,160,22],[162,11,162,14],[154,11,154,14],[155,11,155,14],[158,23,158,25],[157,11,157,14],[157,15,157,18],[157,19,157,22],[157,23,157,25],[162,23,162,25],[153,19,156,22],[163,5,165,10],[163,11,165,14],[163,15,165,18],[163,19,163,22],[164,19,164,22],[165,19,165,22],[159,26,162,26],[160,11,160,14],[161,0,161,4],[161,5,161,10],[161,11,161,14],[161,15,161,18],[161,19,161,22],[161,23,161,25],[162,0,162,4],[162,15,162,18],[162,19,162,22],[183,0,184,22],[183,23,186,25],[185,0,186,22],[222,22,222,24],[222,13,222,15],[222,16,222,18],[222,19,222,21],[219,2,219,12],[220,2,220,12],[215,22,215,24],[216,13,216,15],[216,16,216,18],[216,19,216,21],[216,22,216,24],[217,13,217,15],[217,16,217,18],[217,19,217,21],[217,22,217,24],[218,13,218,15],[218,16,218,18],[218,19,218,21],[218,22,218,24],[213,1,214,12],[217,2,217,12],[224,13,224,15],[224,16,224,18],[224,19,224,21],[220,16,220,18],[220,19,220,21],[220,22,220,24],[221,13,221,15],[221,16,221,18],[221,19,221,21],[221,22,221,24],[223,19,223,21],[223,22,223,24],[225,2,225,12],[137,11,137,14],[225,13,225,15],[225,16,225,18],[225,19,225,21],[225,22,225,24],[221,2,221,12],[222,2,222,12],[223,2,223,12],[224,22,224,24],[224,2,224,12],[219,13,219,15],[219,16,219,18],[219,19,219,21],[219,22,219,24],[220,13,220,15],[223,13,223,15],[223,16,223,18],[164,23,164,25],[168,23,168,24],[218,2,218,12],[215,13,215,15],[215,16,215,18],[215,19,215,21],[215,2,215,12],[216,2,216,12],[213,13,213,24],[214,13,214,15],[214,16,214,18],[214,19,214,21],[214,22,214,24],[195,1,199,6],[195,7,195,24],[196,7,196,24],[205,1,206,6],[205,7,206,24],[207,1,208,6],[207,7,208,24],[200,1,204,6],[200,7,200,24],[201,7,201,24],[202,7,202,24],[203,7,203,24],[204,7,204,24],[197,7,197,24],[198,7,198,24],[199,7,199,24],[167,26,174,26],[168,11,168,14],[169,11,169,14],[175,0,176,4],[175,5,177,10],[175,11,177,14],[167,0,170,4],[167,5,170,10],[167,15,170,18],[172,11,172,14],[174,0,174,4],[174,5,174,10],[174,11,174,14],[174,15,174,18],[174,19,174,22],[175,15,177,18],[175,19,175,22],[176,19,176,22],[171,15,173,18],[171,19,173,22],[171,23,171,24],[177,0,177,4],[177,19,177,22],[171,5,173,10],[148,19,152,22],[157,5,157,10],[158,11,158,14],[158,15,158,18],[158,19,158,22],[158,0,158,4],[167,19,170,22],[179,0,179,25],[171,0,173,4],[172,23,172,25],[159,23,159,25],[175,23,175,25],[166,0,166,25],[174,23,174,25],[158,5,158,10],[153,0,156,4],[153,5,156,10],[162,5,162,10],[159,0,160,4],[159,5,160,10],[159,11,159,14],[157,0,157,4],[150,23,150,25],[163,0,165,4]]}
[{"$f":"NCOM&\" (\"&PCOM&\")\"","v":"Comune di Trescore Cremasco (CR)"},null,null,null,null,null,null,{"$f":"IF(INDEX(INT,1,13)=\"\",INDEX(INT,1,1),INDEX(INT,1,13))","v":"Piano di Emergenza Intercomunale di Protezione Civile"},null,null,null,null,null,null,null,null,null,null,null,{"$f":"IF(TIPOP=\"Edizione\",\"Ed. \",IF(TIPOP=\"Revisione\",\"Rev. \",\"Bozza \"))&TIPON&\" del \"&TIPOD","v":"Ed. 01 del 04/11/2012"}]
[]
[]
["Scheda Scenario",null,null,null,null,null,null,null,null,null,null,null,null,null,null,null,null,null,null,null,null,null,null,{"$f":"_RT3","v":"RS.3"}]
[]
[{"$f":"IF(INDEX(RT3PAR,1,19)=\"\",INDEX(RT3PAR,1,12),INDEX(RT3PAR,1,19))&\" - Fase di Emergenza\"","v":"Rischio Sismico - Fase di Emergenza"}]
[]
[]
[null,"Paragrafi di Riferimento ",null,null,null,null,null,null,null,null,{"$f":"INDEX(RT3PAR,1,1)&INDEX(RT3PAR,1,12)","v":"2.2.3 - 3.2.7 Procedure per il Rischio Sismico"}]
[null,"Codice Scheda",null,null,null,null,null,null,null,null,{"$f":"X4","v":"RS.3"}]
[null,"Evento atteso",null,null,null,null,null,null,null,null,"Evento sismico di intensità tale da essere avvertito dalla popolazione. In caso di terremoto di bassa magnitudo i danni possono essere causati in strutture in cattivo stato di manutenzione o in luoghi del territorio che causano amplificazione locale delle onde sismiche. In caso di magnitudo più elevata il danno risulta più esteso, con danni maggiori nei luoghi più vicini all'epicentro. In questa fase si è venuti a conoscenza di danni nel territorio causati dal sisma."]
[]
[]
[]
[]
[]
[]
[]
[null,"Attività U.C.L.",null,null,null,null,null,null,null,null,"Organizza l'evacuazione della popolazione degli stabili lesionati e ne cura la sistemazione nelle aree di emergenza. Organizza i primi soccorsi sul territrorio e si coordina con il COM, se istituito."]
[]
[]
[null,"Ubicazione intervento",null,null,null,null,null,null,null,null,"Intero territorio comunale"]
[null,"Personale mobilitato",null,null,null,null,null,null,null,null,{"$f":"IF(INDEX(RT3PER,1,1)=\"\",\"\",\"- \"&VLOOKUP(INDEX(RT3PER,1,1),Personale,IF(INDEX(Personale,INDEX(RT3PER,1,1),14)=\"\",2,14)))","v":"- Polizia Locale"},null,null,null,null,null,null,"Riportare la composizione delle squadre nel Modulo M1"]
[null,null,null,null,null,null,null,null,null,null,{"$f":"IF(INDEX(RT3PER,1,2)=\"\",\"\",\"- \"&VLOOKUP(INDEX(RT3PER,1,2),Personale,IF(INDEX(Personale,INDEX(RT3PER,1,2),14)=\"\",2,14)))","v":"- Volontari P.C."}]
[null,null,null,null,null,null,null,null,null,null,{"$f":"IF(INDEX(RT3PER,1,3)=\"\",\"\",\"- \"&VLOOKUP(INDEX(RT3PER,1,3),Personale,IF(INDEX(Personale,INDEX(RT3PER,1,3),14)=\"\",2,14)))","v":"- Tecnici/Operai Comunali"}]
[null,"Attività personale mobilitato",null,null,null,null,null,null,null,null,"Principalmente si occupa di soccorrere e di informare la popolazione sugli sviluppi e della crisi."]
[]
[null,"Grado di coinvolgimento della popolazione",null,null,null,null,null,null,null,null,"Strettamente legato alla magnitudo del sisma. Si può andare da un sostanziale nulla di fatto a gravi danni alle abitazioni che costringono più o meno ampie porzioni di popolazione ad abbandonare le case per periodi di tempo anche lunghi."]
[]
[]
[]
[null,null,null,null,null,null,null,null,null,null,"Registrare le persone eventualmente evacuate nel Modulo M2"]
[null,"Cancelli e vie alternative",null,null,null,null,null,null,null,null,"Vengono interdette le vie di comunicazione la cui percorrenza è diventata pericolose a causa di strutture danneggiate come edifici lungo le strade o ponti o a causa dell'innescarsi di fenomeni di istabilità come frane o liquefazione del terreno."]
[]
[]
[]
[]
[null,"Aree di raccolta popolazione",null,null,null,{"$f":"IF(INDEX(RT3RIC,1,1)=\"\",\"In questa fase non è prevista l’attivazione di tali aree.\",\"Per questa emergenza \"&IF(INDEX(RT3RIC,1,2)=\"\",\"è disponibile la seguente area:\",\"sono disponibili le seguenti aree:\"))","v":"Per questa emergenza sono disponibili le seguenti aree:"}]
[null,null,null,null,null,{"$f":"IF(INDEX(RT3RIC,1,1)=\"\",\"\",\"- \"&VLOOKUP(INDEX(RT3RIC,1,1),Ricovero,2))","v":"- Centro Sportivo Comunale - Carta AE.41 - Trescore Cremasco - Ricovero/Tendopoli"}]
[null,null,null,null,null,{"$f":"IF(INDEX(RT3RIC,1,2)=\"\",\"\",\"- \"&VLOOKUP(INDEX(RT3RIC,1,2),Ricovero,2))","v":"- Scuola Secondaria di I Grado \"Manzoni\" - Carta AE.42 - Trescore Cremasco - Ricovero"}]
[null,null,null,null,null,{"$f":"IF(INDEX(RT3RIC,1,3)=\"\",\"\",\"- \"&VLOOKUP(INDEX(RT3RIC,1,3),Ricovero,2))","v":"- Scuola Primaria Trescore Cremasco - Carta AE.43 - Trescore Cremasco - Ricovero"}]
[null,"Area di ricovero",null,null,null,{"$f":"IF(INDEX(RT3RIC,1,4)=\"\",\"\",\"- \"&VLOOKUP(INDEX(RT3RIC,1,4),Ricovero,2))","v":""}]
[null,null,null,null,null,{"$f":"IF(INDEX(RT3RIC,1,5)=\"\",\"\",\"- \"&VLOOKUP(INDEX(RT3RIC,1,5),Ricovero,2))","v":""}]
[null,null,null,null,null,{"$f":"IF(INDEX(RT3RIC,1,6)=\"\",\"\",\"- \"&VLOOKUP(INDEX(RT3RIC,1,6),Ricovero,2))","v":""}]
[null,null,null,null,null,{"$f":"IF(INDEX(RT3RIC,1,7)=\"\",\"\",\"- \"&VLOOKUP(INDEX(RT3RIC,1,7),Ricovero,2))","v":""}]
[null,null,null,null,null,{"$f":"IF(F40=\"\",\"\",\"In funzione della gravità della situazione si decide quali/quante aree attivare.\")","v":"In funzione della gravità della situazione si decide quali/quante aree attivare."}]
[null,"Area di raduno soccorritori",null,null,null,{"$f":"IF(INDEX(RT3SOC,1,1)=\"\",\"In questa fase non è prevista l’attivazione di tali aree.\",\"Per questa emergenza \"&IF(INDEX(RT3SOC,1,2)=\"\",\"è disponibile la seguente area:\",\"sono disponibili le seguenti aree:\"))","v":"Per questa emergenza sono disponibili le seguenti aree:"}]
[null,null,null,null,null,{"$f":"IF(INDEX(RT3SOC,1,1)=\"\",\"\",\"- \"&VLOOKUP(INDEX(RT3SOC,1,1),Soccorritori,2))","v":"- Centro Sportivo Comunale - Carte AE.41 - Trescore Cremasco - SV.41 - Aviosuperficie"}]
[null,null,null,null,null,{"$f":"IF(INDEX(RT3SOC,1,2)=\"\",\"\",\"- \"&VLOOKUP(INDEX(RT3SOC,1,2),Soccorritori,2))","v":"- Centro Sportivo Comunale - Carte AE.41 - Trescore Cremasco - SV.41 - Ammassamento"}]
[null,null,null,null,null,{"$f":"IF(INDEX(RT3SOC,1,3)=\"\",\"\",\"- \"&VLOOKUP(INDEX(RT3SOC,1,3),Soccorritori,2))","v":""}]
[null,null,null,null,null,{"$f":"IF(F49=\"\",\"\",\"In funzione della gravità della situazione si decide quali/quante aree attivare.\")","v":"In funzione della gravità della situazione si decide quali/quante aree attivare."}]
[null,"Ordinanze Necessarie",null,null,null,null,null,null,null,null,"Ordinanza di Evacuazione;"]
[null,null,null,null,null,null,null,null,null,null,"Ordinanza di Chiusura Strade."]
[null,"Modalita’ Riunione U.C.L.",null,null,null,null,null,null,null,null,null,"Non necessaria"]
[null,null,null,null,null,null,null,null,null,null,null,"Virtuale"]
[null,null,null,null,null,null,null,null,null,null,"X","In sede"]
[null,"Possibili Scenari Concomitanti",null,null,null,null,null,null,null,null,"Il sisma può innescare altre calamità, come frane, danni alla rete di distribuzione del gas ed incidenti rilevanti. Per fronteggiare tali evenienze si rimanda alle Procedure RI.3, RG.2 - RG.3 e IR.3."]
[]
[]
[null,"Contatti Utili",null,null,null,null,null,null,null,null,{"$f":"\"Consultare il \"&IF([1]Maschera!Z71=\"\",[1]Maschera!N71,[1]Maschera!Z71)","v":"Consultare il Tomo Giallo - Risorse"}]
[null,"Cartografia",null,null,null,null,null,null,null,null,{"$f":"INDEX(RT3PAR,1,28)","v":"Tav. 3/C - Rischio Viabilità - AIB - Altri Rischi"}]
[null,null,null,null,null,null,null,null,null,null,{"$f":"INDEX(RT3PAR,1,39)","v":"Tav. 3/D - Stradario Piano di Emergenza"}]
[]
[{"$f":"Titolo2","v":"Procedure U.C.L."},null,null,null,null,null,null,null,null,null,null,null,null,null,null,null,null,null,null,null,null,null,null,{"$f":"_RT3","v":"RS.3"}]
[]
[{"$f":"$A$6","v":"Rischio Sismico - Fase di Emergenza"}]
[]
[]
[]
[]
[]
[]
[]
[]
[]
[]
[]
[]
[]
[]
[]
[]
[]
[]
[]
[]
[]
[]
[]
[]
[]
[]
[]
[]
[]
[]
[]
[]
[]
[]
[]
[]
[]
[]
[]
[]
[]
[]
[]
[]
[]
[]
[]
[]
[]
[]
[]
[]
[]
[]
[]
[]
[]
[{"$f":"Titolo2","v":"Procedure U.C.L."},null,null,null,null,null,null,null,null,null,null,null,null,null,null,null,null,null,null,null,null,null,null,{"$f":"X4","v":"RS.3"}]
[]
[{"$f":"$A$6","v":"Rischio Sismico - Fase di Emergenza"}]
[]
[]
["RESPONSABILE",null,null,null,null,"AZIONE",null,null,null,null,null,"CHIAMATE"]
[null,null,null,null,null,null,null,null,null,null,null,"MEMBRO UCL",null,null,null,"OPERATIVI",null,null,null,"ENTE INTERESSATO",null,null,null,"SCHEDE RISORSE"]
[]
["SE LE STRUTTURE OPERATIVE SONO EFFICIENTI"]
[{"$f":"IF(INDEX(Sindaco,1,9)=\"\",INDEX(Sindaco,1,1),INDEX(Sindaco,1,9))","v":"SINDACO / R.O.C."},null,null,null,null,{"$f":"\"Dispone i primi soccorsi per la popolazione colpita, la rimozione dei principali ostacoli per la circolazione ed il ripristino dei servizi principali. Dispone cancelli sulla viabilità e procede con l'informazione alla popolazione. \"&_RT3&\".1\"","v":"Dispone i primi soccorsi per la popolazione colpita, la rimozione dei principali ostacoli per la circolazione ed il ripristino dei servizi principali. Dispone cancelli sulla viabilità e procede con l'informazione alla popolazione. RS.3.1"},null,null,null,null,null,null,null,null,null,null,null,null,null,"--",null,null,null,null,null,null,{"$f":"_RT3&\".1\"","v":"RS.3.1"}]
[]
[null,null,null,null,null,null,null,null,null,null,null,{"$f":"\"- \"&PROPER(IF(INDEX(PL,1,9)=\"\",INDEX(PL,1,1),INDEX(PL,1,9)))","v":"- Polizia Locale"},null,null,null,"- VV.F."]
[null,null,null,null,null,null,null,null,null,null,null,{"$f":"\"- \"&PROPER(IF(INDEX(CV,1,9)=\"\",INDEX(CV,1,1),INDEX(CV,1,9)))","v":"- C. Volontariato"},null,null,null,{"$f":"\"- \"&IF(INDEX(CRI,1,9)=\"\",INDEX(CRI,1,1),INDEX(CRI,1,9))","v":"- 118"},null,null,null,null,null,null,null,"O1 - O2"]
[null,null,null,null,null,null,null,null,null,null,null,{"$f":"\"- \"&PROPER(IF(INDEX(CC,1,9)=\"\",INDEX(CC,1,1),INDEX(CC,1,9)))","v":"- C. Carabinieri"},null,null,null,null,null,null,null,null,null,null,null,"C2.1","C2.2","C2.3"]
[null,null,null,null,null,null,null,null,null,null,null,{"$f":"\"- \"&PROPER(IF(INDEX(RT,1,9)=\"\",INDEX(RT,1,1),INDEX(RT,1,9)))","v":"- Resp. Territorio"}]
[]
[]
[{"$f":"IF(INDEX(RT,1,9)=\"\",INDEX(RT,1,1),INDEX(RT,1,9))","v":"RESP. TERRITORIO"},null,null,null,null,{"$f":"\"Responsabile parte tecnica \"&_RT3&\".1\"","v":"Responsabile parte tecnica RS.3.1"},null,null,null,null,null,null,null,null,null,{"$f":"\"- \"&IF(INDEX(TCO,1,9)=\"\",INDEX(TCO,1,1),INDEX(TCO,1,9))","v":"- Tecnici Comunali"},null,null,null,{"$f":"\"- \"&IF(INDEX(STER,1,9)=\"\",INDEX(STER,1,1),INDEX(STER,1,9))","v":"- STER"},null,null,null,"O1 - O2",null,"A2.1"]
[null,null,null,null,null,null,null,null,null,null,null,{"$f":"\"- \"&PROPER(IF(INDEX(CV,1,9)=\"\",INDEX(CV,1,1),INDEX(CV,1,9)))","v":"- C. Volontariato"},null,null,null,{"$f":"\"- \"&IF(INDEX(tel,1,9)=\"\",INDEX(tel,1,1),INDEX(tel,1,9))","v":"- Gestore Telefonia"},null,null,null,null,null,null,null,"A4","A5","B2"]
[null,null,null,null,null,null,null,null,null,null,null,null,null,null,null,{"$f":"\"- \"&IF(INDEX(GEE,1,9)=\"\",INDEX(GEE,1,1),INDEX(GEE,1,9))","v":"- Gestore Elettricità"},null,null,null,null,null,null,null,"B4","C1","C2.4"]
[null,null,null,null,null,null,null,null,null,null,null,null,null,null,null,{"$f":"\"- \"&IF(INDEX(GEA,1,9)=\"\",INDEX(GEA,1,1),INDEX(GEA,1,9))","v":"- Gestore Acquedotto"}]
[{"$f":"IF(INDEX(PL,1,9)=\"\",INDEX(PL,1,1),INDEX(PL,1,9))","v":"POLIZIA LOCALE"},null,null,null,null,{"$f":"\"Responsabile cancelli ed informazione \"&_RT3&\".1\"","v":"Responsabile cancelli ed informazione RS.3.1"},null,null,null,null,null,{"$f":"\"- \"&PROPER(IF(INDEX(CV,1,9)=\"\",INDEX(CV,1,1),INDEX(CV,1,9)))","v":"- C. Volontariato"},null,null,null,{"$f":"\"- \"&IF(INDEX(PLO,1,9)=\"\",INDEX(PLO,1,1),INDEX(PLO,1,9))","v":"- Agenti P.L."},null,null,null,"--",null,null,null,"O1 - O2  A2.2"]
[null,null,null,null,null,null,null,null,null,null,null,{"$f":"\"- \"&PROPER(IF(INDEX(CC,1,9)=\"\",INDEX(CC,1,1),INDEX(CC,1,9)))","v":"- C. Carabinieri"}]
[{"$f":"IF(INDEX(CV,1,9)=\"\",INDEX(CV,1,1),INDEX(CV,1,9))","v":"C. VOLONTARIATO"},null,null,null,null,{"$f":"\"Coadiuva \"&_RT3&\".1\"","v":"Coadiuva RS.3.1"},null,null,null,null,null,"--",null,null,null,{"$f":"\"- \"&IF(INDEX(VO,1,9)=\"\",INDEX(VO,1,1),INDEX(VO,1,9))","v":"- Gruppi Volontari"},null,null,null,"--",null,null,null,"A3 - B3"]
[{"$f":"IF(INDEX(CC,1,9)=\"\",INDEX(CC,1,1),INDEX(CC,1,9))","v":"C. CARABINIERI"},null,null,null,null,{"$f":"\"Coadiuva \"&_RT3&\".1\"","v":"Coadiuva RS.3.1"},null,null,null,null,null,"--",null,null,null,{"$f":"\"- \"&IF(INDEX(CO,1,9)=\"\",INDEX(CO,1,1),INDEX(CO,1,9))","v":"- Carabinieri"},null,null,null,"--",null,null,null,"--"]
[{"$f":"IF(INDEX(Sindaco,1,9)=\"\",INDEX(Sindaco,1,1),INDEX(Sindaco,1,9))","v":"SINDACO / R.O.C."},null,null,null,null,{"$f":"\"Attiva le aree di emergenza per accogliere i senza tetto (\"&_RT3&\".2)\"&\" ed ordina evacuazioni di edifici pericolanti in accordo con VV.F. e STER (\"&_RT3&\".3).\"","v":"Attiva le aree di emergenza per accogliere i senza tetto (RS.3.2) ed ordina evacuazioni di edifici pericolanti in accordo con VV.F. e STER (RS.3.3)."},null,null,null,null,null,null,null,null,null,"- VV.F.",null,null,null,{"$f":"\"- \"&IF(INDEX(STER,1,9)=\"\",INDEX(STER,1,1),INDEX(STER,1,9))","v":"- STER"},null,null,null,null,null,null,{"$f":"_RT3&\".2\"","v":"RS.3.2"}]
[null,null,null,null,null,null,null,null,null,null,null,{"$f":"\"- \"&PROPER(IF(INDEX(RT,1,9)=\"\",INDEX(RT,1,1),INDEX(RT,1,9)))","v":"- Resp. Territorio"},null,null,null,null,null,null,null,null,null,null,null,"O1 - O2"]
[null,null,null,null,null,null,null,null,null,null,null,{"$f":"\"- \"&PROPER(IF(INDEX(CV,1,9)=\"\",INDEX(CV,1,1),INDEX(CV,1,9)))","v":"- C. Volontariato"},null,null,null,null,null,null,null,null,null,null,null,"C2.1  C2.4"]
[null,null,null,null,null,null,null,null,null,null,null,{"$f":"\"- \"&PROPER(IF(INDEX(RSS,1,9)=\"\",INDEX(RSS,1,1),INDEX(RSS,1,9)))","v":"- Resp. Serv. Sociali"}]
[]
[{"$f":"IF(INDEX(RT,1,9)=\"\",INDEX(RT,1,1),INDEX(RT,1,9))","v":"RESP. TERRITORIO"},null,null,null,null,{"$f":"\"Responsabile \"&_RT3&\".2\"","v":"Responsabile RS.3.2"},null,null,null,null,null,null,null,null,null,null,null,null,null,"--",null,null,null,"O1 - O2",null,"A2.1"]
[null,null,null,null,null,null,null,null,null,null,null,{"$f":"\"- \"&PROPER(IF(INDEX(CV,1,9)=\"\",INDEX(CV,1,1),INDEX(CV,1,9)))","v":"- C. Volontariato"},null,null,null,{"$f":"\"- \"&IF(INDEX(TCO,1,9)=\"\",INDEX(TCO,1,1),INDEX(TCO,1,9))","v":"- Tecnici Comunali"},null,null,null,null,null,null,null,"A2.3","A4","A5"]
[null,null,null,null,null,null,null,null,null,null,null,{"$f":"\"- \"&PROPER(IF(INDEX(RSS,1,9)=\"\",INDEX(RSS,1,1),INDEX(RSS,1,9)))","v":"- Resp. Serv. Sociali"},null,null,null,{"$f":"\"- \"&IF(INDEX(OP,1,9)=\"\",INDEX(OP,1,1),INDEX(OP,1,9))","v":"- Operai"},null,null,null,null,null,null,null,"A6","A7.1","A7.2"]
[null,null,null,null,null,null,null,null,null,null,null,null,null,null,null,null,null,null,null,null,null,null,null,"B5","B6","C1"]
[{"$f":"IF(INDEX(CV,1,9)=\"\",INDEX(CV,1,1),INDEX(CV,1,9))","v":"C. VOLONTARIATO"},null,null,null,null,{"$f":"\"Coadiuva \"&_RT3&\".2\"","v":"Coadiuva RS.3.2"},null,null,null,null,null,"--",null,null,null,{"$f":"\"- \"&IF(INDEX(VO,1,9)=\"\",INDEX(VO,1,1),INDEX(VO,1,9))","v":"- Gruppi Volontari"},null,null,null,"--",null,null,null,"A3 - B3"]
[{"$f":"IF(INDEX(RSS,1,9)=\"\",INDEX(RSS,1,1),INDEX(RSS,1,9))","v":"RESP. SERV. SOCIALI"},null,null,null,null,{"$f":"\"Coadiuva \"&_RT3&\".2\"","v":"Coadiuva RS.3.2"},null,null,null,null,null,"--",null,null,null,{"$f":"\"- \"&IF(INDEX(SO,1,9)=\"\",INDEX(SO,1,1),INDEX(SO,1,9))","v":"- Pers. Sanitario"},null,null,null,"--",null,null,null,"B1 - C2.2 - D1"]
[{"$f":"IF(INDEX(PL,1,9)=\"\",INDEX(PL,1,1),INDEX(PL,1,9))","v":"POLIZIA LOCALE"},null,null,null,null,{"$f":"\"Responsabile \"&_RT3&\".3\"","v":"Responsabile RS.3.3"},null,null,null,null,null,{"$f":"\"- \"&PROPER(IF(INDEX(CV,1,9)=\"\",INDEX(CV,1,1),INDEX(CV,1,9)))","v":"- C. Volontariato"},null,null,null,{"$f":"\"- \"&IF(INDEX(PLO,1,9)=\"\",INDEX(PLO,1,1),INDEX(PLO,1,9))","v":"- Agenti P.L."},null,null,null,"--",null,null,null,"O1 - O2  A2.2",null,null,{"$f":"_RT3&\".3\"","v":"RS.3.3"}]
[null,null,null,null,null,null,null,null,null,null,null,{"$f":"\"- \"&PROPER(IF(INDEX(CC,1,9)=\"\",INDEX(CC,1,1),INDEX(CC,1,9)))","v":"- C. Carabinieri"},null,null,null,null,null,null,null,null,null,null,null,"M2","D2"]
[{"$f":"IF(INDEX(CV,1,9)=\"\",INDEX(CV,1,1),INDEX(CV,1,9))","v":"C. VOLONTARIATO"},null,null,null,null,{"$f":"\"Coadiuva \"&_RT3&\".3\"","v":"Coadiuva RS.3.3"},null,null,null,null,null,"--",null,null,null,{"$f":"\"- \"&IF(INDEX(VO,1,9)=\"\",INDEX(VO,1,1),INDEX(VO,1,9))","v":"- Gruppi Volontari"},null,null,null,"--",null,null,null,"A3 - B3"]
[{"$f":"IF(INDEX(CC,1,9)=\"\",INDEX(CC,1,1),INDEX(CC,1,9))","v":"C. CARABINIERI"},null,null,null,null,{"$f":"\"Coadiuva \"&_RT3&\".3\"","v":"Coadiuva RS.3.3"},null,null,null,null,null,"--",null,null,null,{"$f":"\"- \"&IF(INDEX(CO,1,9)=\"\",INDEX(CO,1,1),INDEX(CO,1,9))","v":"- Carabinieri"},null,null,null,"--",null,null,null,"--"]
[{"$f":"IF(INDEX(Sindaco,1,9)=\"\",INDEX(Sindaco,1,1),INDEX(Sindaco,1,9))","v":"SINDACO / R.O.C."},null,null,null,null,"Informa periodicamente gli enti sovraordinati e i media su quanto fatto.",null,null,null,null,null,"- Tutti",null,null,null,"--",null,null,null,{"$f":"\"- \"&IF(INDEX(PR,1,9)=\"\",INDEX(PR,1,1),INDEX(PR,1,9))","v":"- Prefettura"}]
[null,null,null,null,null,null,null,null,null,null,null,null,null,null,null,null,null,null,null,{"$f":"\"- \"&IF(INDEX(PRO,1,9)=\"\",INDEX(PRO,1,1),INDEX(PRO,1,9))","v":"- Provincia"},null,null,null,"O1 - O2"]
[null,null,null,null,null,null,null,null,null,null,null,null,null,null,null,null,null,null,null,{"$f":"\"- \"&IF(INDEX(REG,1,9)=\"\",INDEX(REG,1,1),INDEX(REG,1,9))","v":"- Regione"},null,null,null,"C2.1","C2.3","C2.4"]
["SE NON SI PUO' FRONTEGGIARE LA CRISI CON I MEZZI A DISPOSIZIONE"]
[{"$f":"IF(INDEX(Sindaco,1,9)=\"\",INDEX(Sindaco,1,1),INDEX(Sindaco,1,9))","v":"SINDACO / R.O.C."},null,null,null,null,{"$f":"\"Si coordina con il \"&COM&\", se costituito, o ne richiede l'attivazione ed attiva le aree di ammassamento soccorsi . \"&_RI3&\".4\"","v":"Si coordina con il COM Monza, se costituito, o ne richiede l'attivazione ed attiva le aree di ammassamento soccorsi . RI.4.4"},null,null,null,null,null,null,null,null,null,"--",null,null,null,{"$f":"\"- \"&COM","v":"- COM Monza"},null,null,null,null,null,null,{"$f":"_RT3&\".4\"","v":"RS.3.4"}]
[null,null,null,null,null,null,null,null,null,null,null,{"$f":"\"- \"&PROPER(IF(INDEX(RT,1,9)=\"\",INDEX(RT,1,1),INDEX(RT,1,9)))","v":"- Resp. Territorio"},null,null,null,null,null,null,null,null,null,null,null,"O1 - O2",null,"C2.1"]
[null,null,null,null,null,null,null,null,null,null,null,{"$f":"\"- \"&PROPER(IF(INDEX(CV,1,9)=\"\",INDEX(CV,1,1),INDEX(CV,1,9)))","v":"- C. Volontariato"}]
[]
[{"$f":"IF(INDEX(RT,1,9)=\"\",INDEX(RT,1,1),INDEX(RT,1,9))","v":"RESP. TERRITORIO"},null,null,null,null,{"$f":"\"Responsabile \"&_RI3&\".4\"","v":"Responsabile RI.4.4"},null,null,null,null,null,null,null,null,null,{"$f":"\"- \"&IF(INDEX(TCO,1,9)=\"\",INDEX(TCO,1,1),INDEX(TCO,1,9))","v":"- Tecnici Comunali"},null,null,null,"--",null,null,null,"O1 - O2",null,"A2.1"]
[null,null,null,null,null,null,null,null,null,null,null,{"$f":"\"- \"&PROPER(IF(INDEX(CV,1,9)=\"\",INDEX(CV,1,1),INDEX(CV,1,9)))","v":"- C. Volontariato"},null,null,null,null,null,null,null,null,null,null,null,"A4  A5  A6  A8"]
[null,null,null,null,null,null,null,null,null,null,null,null,null,null,null,null,null,null,null,null,null,null,null,"B5","B6","C1"]
[{"$f":"IF(INDEX(CV,1,9)=\"\",INDEX(CV,1,1),INDEX(CV,1,9))","v":"C. VOLONTARIATO"},null,null,null,null,{"$f":"\"Coadiuva \"&_RI3&\".4\"","v":"Coadiuva RI.4.4"},null,null,null,null,null,"--",null,null,null,{"$f":"\"- \"&IF(INDEX(VO,1,9)=\"\",INDEX(VO,1,1),INDEX(VO,1,9))","v":"- Gruppi Volontari"},null,null,null,"--",null,null,null,"A3 - B3"]
[{"$f":"IF(INDEX(Sindaco,1,9)=\"\",INDEX(Sindaco,1,1),INDEX(Sindaco,1,9))","v":"SINDACO / R.O.C."},null,null,null,null,"Informa sulla revoca dello stato di emergenza.",null,null,null,null,null,"- Tutti",null,null,null,{"$f":"\"- \"&IF(INDEX(SC,1,9)=\"\",INDEX(SC,1,1),INDEX(SC,1,9))","v":"- Squadre Operativi"},null,null,null,{"$f":"\"- \"&IF(INDEX(PR,1,9)=\"\",INDEX(PR,1,1),INDEX(PR,1,9))","v":"- Prefettura"},null,null,null,"O1 - O2"]
[null,null,null,null,null,null,null,null,null,null,null,null,null,null,null,null,null,null,null,{"$f":"\"- \"&IF(INDEX(PRO,1,9)=\"\",INDEX(PRO,1,1),INDEX(PRO,1,9))","v":"- Provincia"},null,null,null,"C2.1","C2.3","C2.4"]
["MEMBRI U.C.L",null,null,null,null,null,null,null,null,null,null,null,null,null,null,null,null,null,null,{"$f":"\"- \"&IF(INDEX(REG,1,9)=\"\",INDEX(REG,1,1),INDEX(REG,1,9))","v":"- Regione"},null,null,null,null,"M1"]
[]
["PER LE COMUNICAZIONI EVIDENZIATE IN ROSSO UTILIZZARE IL MODULO FAX M4"]
[]
[]
[]
[{"$f":"Titolo3","v":"Scheda Procedura Operativa"},null,null,null,null,null,null,null,null,null,null,null,null,null,null,null,null,null,null,null,null,null,null,{"$f":"X4","v":"RS.3"}]
[]
[{"$f":"$A$6","v":"Rischio Sismico - Fase di Emergenza"}]
[]
[]
[null,"Codice Scheda Scenario",null,null,null,null,null,{"$f":"X4","v":"RS.3"}]
[null,"Tipo di Procedure",null,null,null,null,null,{"$f":"_RT3&\".1 \"&_RT3&\".2 \"&_RT3&\".3 \"&_RT3&\".4 - AZIONI DI SALVAGUARDIA\"","v":"RS.3.1 RS.3.2 RS.3.3 RS.3.4 - AZIONI DI SALVAGUARDIA"}]
[null,"Ubicazione intervento",null,null,null,null,null,"Intero territorio comunale"]
[null,"Aree di raccolta popolazione",null,null,null,null,null,{"$f":"IF(INDEX(RT3RIC,1,1)=\"\",\"In questa fase non è prevista l’attivazione di tali aree.\",\"Per questa emergenza \"&IF(INDEX(RT3RIC,1,2)=\"\",\"è disponibile la seguente area:\",\"sono disponibili le seguenti aree:\"))","v":"Per questa emergenza sono disponibili le seguenti aree:"}]
[null,null,null,null,null,null,null,{"$f":"IF(INDEX(RT3RIC,1,1)=\"\",\"\",\"- \"&VLOOKUP(INDEX(RT3RIC,1,1),Ricovero,2))","v":"- Centro Sportivo Comunale - Carta AE.41 - Trescore Cremasco - Ricovero/Tendopoli"}]
[null,null,null,null,null,null,null,{"$f":"IF(INDEX(RT3RIC,1,2)=\"\",\"\",\"- \"&VLOOKUP(INDEX(RT3RIC,1,2),Ricovero,2))","v":"- Scuola Secondaria di I Grado \"Manzoni\" - Carta AE.42 - Trescore Cremasco - Ricovero"}]
[null,null,null,null,null,null,null,{"$f":"IF(INDEX(RT3RIC,1,3)=\"\",\"\",\"- \"&VLOOKUP(INDEX(RT3RIC,1,3),Ricovero,2))","v":"- Scuola Primaria Trescore Cremasco - Carta AE.43 - Trescore Cremasco - Ricovero"}]
[null,"Area di ricovero",null,null,null,null,null,{"$f":"IF(INDEX(RT3RIC,1,4)=\"\",\"\",\"- \"&VLOOKUP(INDEX(RT3RIC,1,4),Ricovero,2))","v":""}]
[null,null,null,null,null,null,null,{"$f":"IF(INDEX(RT3RIC,1,5)=\"\",\"\",\"- \"&VLOOKUP(INDEX(RT3RIC,1,5),Ricovero,2))","v":""}]
[null,null,null,null,null,null,null,{"$f":"IF(INDEX(RT3RIC,1,6)=\"\",\"\",\"- \"&VLOOKUP(INDEX(RT3RIC,1,6),Ricovero,2))","v":""}]
[null,null,null,null,null,null,null,{"$f":"IF(INDEX(RT3RIC,1,7)=\"\",\"\",\"- \"&VLOOKUP(INDEX(RT3RIC,1,7),Ricovero,2))","v":""}]
[null,null,null,null,null,null,null,{"$f":"IF(H194=\"\",\"\",\"In funzione della gravità della situazione si decide quali/quante aree attivare.\")","v":"In funzione della gravità della situazione si decide quali/quante aree attivare."}]
[null,"Area di raduno soccorritori",null,null,null,null,null,{"$f":"IF(INDEX(RT3SOC,1,1)=\"\",\"In questa fase non è prevista l’attivazione di tali aree.\",\"Per questa emergenza \"&IF(INDEX(RT3SOC,1,2)=\"\",\"è disponibile la seguente area:\",\"sono disponibili le seguenti aree:\"))","v":"Per questa emergenza sono disponibili le seguenti aree:"}]
[null,null,null,null,null,null,null,{"$f":"IF(INDEX(RT3SOC,1,1)=\"\",\"\",\"- \"&VLOOKUP(INDEX(RT3SOC,1,1),Soccorritori,2))","v":"- Centro Sportivo Comunale - Carte AE.41 - Trescore Cremasco - SV.41 - Aviosuperficie"}]
[null,null,null,null,null,null,null,{"$f":"IF(INDEX(RT3SOC,1,2)=\"\",\"\",\"- \"&VLOOKUP(INDEX(RT3SOC,1,2),Soccorritori,2))","v":"- Centro Sportivo Comunale - Carte AE.41 - Trescore Cremasco - SV.41 - Ammassamento"}]
[null,null,null,null,null,null,null,{"$f":"IF(INDEX(RT3SOC,1,3)=\"\",\"\",\"- \"&VLOOKUP(INDEX(RT3SOC,1,3),Soccorritori,2))","v":""}]
[null,null,null,null,null,null,null,{"$f":"IF(H203=\"\",\"\",\"In funzione della gravità della situazione si decide quali/quante aree attivare.\")","v":"In funzione della gravità della situazione si decide quali/quante aree attivare."}]
[null,"Cancelli e vie alternative",null,null,null,null,null," --"]
[]
[null,"Contatti Utili",null,null,null,null,null,"Si faccia riferimento al PRONTUARIO DI EMERGENZA - CONTATTI"]
[]
[]
[]
[]
[]
[null,"Procedura Operativa Standard (POS)",null,null,null,null,null,null,null,null,null,null,null,"Procedure Previste"]
[null,null,null,null,null,null,null,null,null,null,null,null,null,{"$f":"MID(H190,1,6)","v":"RS.3.1"},null,null,{"$f":"MID(H190,8,6)","v":"RS.3.2"},null,null,{"$f":"MID(H190,15,6)","v":"RS.3.3"},null,null,{"$f":"MID(H190,22,6)","v":"RS.3.4"}]
[null,1,"Monitoraggio",null,null,null,null,null,null,null,null,null,null,"--",null,null,"--",null,null,"--",null,null,"--"]
[null,2,"Perlustrazione",null,null,null,null,null,null,null,null,null,null,"--",null,null,"--",null,null,"--",null,null,"--"]
[null,3,"Presidio Cancelli/Supporto Viabilità",null,null,null,null,null,null,null,null,null,null,"X",null,null,"--",null,null,"--",null,null,"--"]
[null,4,"Informazione Diretta alla Popolazione",null,null,null,null,null,null,null,null,null,null,"X",null,null,"--",null,null,"--",null,null,"--"]
[null,5,"Allestimento Area di Ricovero",null,null,null,null,null,null,null,null,null,null,"--",null,null,"X",null,null,"--",null,null,"--"]
[null,6,"Allestimento Area di Ammassamento Soccorsi",null,null,null,null,null,null,null,null,null,null,"--",null,null,"--",null,null,"--",null,null,"X"]
[null,7,"Evacuazione",null,null,null,null,null,null,null,null,null,null,"--",null,null,"--",null,null,"X",null,null,"--"]
[null,8,"Rimozione Ostacoli",null,null,null,null,null,null,null,null,null,null,"X",null,null,"--",null,null,"--",null,null,"--"]
[null,9,"Rimozione Ostacoli da Alveo",null,null,null,null,null,null,null,null,null,null,"--",null,null,"--",null,null,"--",null,null,"--"]
[null,10,"Preservazione Argini",null,null,null,null,null,null,null,null,null,null,"--",null,null,"--",null,null,"--",null,null,"--"]
[null,11,"Frana",null,null,null,null,null,null,null,null,null,null,"--",null,null,"--",null,null,"--",null,null,"--"]

{"sheet":"IR_3","index":8,"n_rows":225,"n_cols":27,"rows_kept":225,"cut":false,"hidden":false,"merged":[[205,1,206,6],[205,7,206,24],[207,1,208,6],[207,7,208,24],[195,1,199,6],[195,7,195,24],[196,7,196,24],[197,7,197,24],[198,7,198,24],[199,7,199,24],[200,1,204,6],[162,23,162,25],[61,10,61,24],[60,1,61,9],[132,23,132,25],[135,15,135,18],[10,1,14,9],[21,13,21,15],[15,10,18,24],[28,1,30,9],[28,10,30,24],[15,1,18,9],[23,1,24,9],[23,10,24,24],[19,1,22,9],[19,10,19,24],[20,10,22,12],[20,13,20,15],[20,16,20,21],[49,1,50,9],[50,10,50,24],[51,1,53,9],[59,1,59,9],[59,10,59,24],[38,1,41,4],[0,0,1,6],[0,7,1,18],[0,19,1,25],[3,0,4,22],[3,23,6,25],[35,1,37,9],[35,10,37,24],[8,1,8,9],[5,0,6,22],[10,10,14,24],[8,10,8,24],[20,22,20,24],[21,16,21,21],[21,22,21,24],[31,1,34,9],[22,13,22,15],[9,1,9,9],[9,10,9,24],[22,16,22,21],[22,22,22,24],[25,1,27,9],[25,17,27,24],[25,10,25,16],[26,10,26,16],[42,1,46,4],[38,5,38,24],[39,5,39,24],[40,5,40,24],[41,5,41,24],[42,5,42,24],[43,5,43,24],[44,5,44,24],[45,5,45,24],[46,5,46,24],[47,1,48,4],[47,5,48,24],[60,10,60,24],[142,23,145,25],[137,0,137,25],[54,1,58,9],[54,10,58,24],[51,11,51,24],[52,11,52,24],[53,11,53,24],[123,0,124,22],[123,23,126,25],[135,23,136,25],[131,0,134,4],[131,5,134,10],[131,11,134,14],[131,15,134,18],[131,19,134,22],[125,0,126,22],[128,0,130,4],[128,5,130,10],[141,15,141,18],[49,10,49,24],[63,0,64,22],[147,23,150,25],[148,15,148,18],[128,11,128,25],[129,11,130,14],[129,15,130,18],[129,19,130,22],[129,23,130,25],[135,0,136,4],[135,5,136,10],[135,11,136,14],[135,19,136,22],[136,15,136,18],[138,0,141,4],[138,5,141,10],[138,11,141,14],[138,15,138,18],[138,19,141,22],[139,15,139,18],[140,15,140,18],[161,15,161,18],[161,19,161,22],[161,23,161,25],[160,19,160,22],[157,11,157,14],[151,0,151,25],[150,15,150,18],[142,26,146,26],[146,0,146,4],[146,5,146,10],[146,11,146,14],[146,15,146,18],[146,19,146,22],[146,23,146,25],[142,0,145,4],[142,5,145,10],[142,11,145,14],[142,15,145,18],[142,19,145,22],[147,0,150,4],[147,5,150,10],[147,11,150,14],[147,15,147,18],[147,19,150,22],[165,15,165,18],[165,19,165,22],[165,23,165,25],[160,0,160,4],[160,15,160,18],[160,5,160,10],[160,11,160,14],[149,15,149,18],[152,26,153,26],[153,19,153,22],[154,19,154,22],[154,26,161,26],[155,19,155,22],[156,0,159,4],[156,5,159,10],[156,15,159,18],[156,19,159,22],[152,0,155,4],[152,5,155,10],[152,15,155,18],[152,19,152,22],[161,0,161,4],[161,5,161,10],[161,11,161,14],[166,0,168,4],[166,5,168,10],[166,11,168,14],[166,15,168,18],[166,19,166,22],[167,19,167,22],[168,19,168,22],[158,11,158,14],[162,26,165,26],[163,11,163,14],[164,0,164,4],[164,5,164,10],[164,11,164,14],[164,15,164,18],[164,19,164,22],[164,23,164,25],[165,0,165,4],[165,5,165,10],[162,0,163,4],[162,5,163,10],[162,11,162,14],[162,15,163,18],[162,19,163,22],[165,11,165,14],[176,5,179,10],[176,11,179,14],[176,15,179,18],[169,19,171,22],[169,23,171,25],[188,1,188,6],[188,7,188,24],[189,1,189,6],[189,7,189,24],[169,5,171,10],[169,11,171,14],[169,15,171,18],[176,26,179,26],[177,19,177,22],[178,19,178,22],[179,0,179,4],[179,19,179,22],[183,0,184,22],[183,23,186,25],[185,0,186,22],[216,20,216,21],[216,22,216,23],[213,20,213,21],[213,22,213,23],[200,7,204,24],[190,1,190,6],[190,7,190,24],[191,1,194,6],[191,7,191,24],[192,7,192,24],[193,7,193,24],[194,7,194,24],[212,2,213,15],[212,16,212,23],[213,16,213,17],[213,18,213,19],[217,16,217,17],[217,18,217,19],[217,20,217,21],[217,22,217,23],[218,16,218,17],[214,3,214,15],[215,3,215,15],[216,3,216,15],[214,16,214,17],[214,18,214,19],[214,20,214,21],[214,22,214,23],[218,18,218,19],[218,20,218,21],[218,22,218,23],[217,3,217,15],[218,3,218,15],[215,16,215,17],[215,18,215,19],[215,20,215,21],[215,22,215,23],[216,16,216,17],[216,18,216,19],[224,3,224,15],[221,16,221,17],[221,18,221,19],[221,20,221,21],[221,22,221,23],[222,16,222,17],[222,18,222,19],[222,20,222,21],[222,22,222,23],[224,16,224,17],[224,18,224,19],[224,20,224,21],[224,22,224,23],[223,16,223,17],[223,18,223,19],[223,20,223,21],[223,22,223,23],[221,3,221,15],[222,3,222,15],[223,3,223,15],[219,16,219,17],[219,18,219,19],[219,20,219,21],[219,22,219,23],[220,16,220,17],[220,18,220,19],[220,20,220,21],[220,22,220,23],[219,3,219,15],[220,3,220,15],[63,23,66,25],[65,0,66,22],[27,10,27,16],[31,10,33,24],[34,10,34,24],[181,0,181,25],[152,23,152,25],[153,23,153,25],[156,23,156,24],[173,23,173,25],[172,23,172,25],[176,23,176,25],[139,23,139,25],[140,23,140,25],[160,23,160,25],[175,0,175,25],[176,19,176,22],[172,0,174,4],[172,5,174,10],[172,11,174,14],[172,15,174,18],[172,19,174,22],[169,0,171,4],[176,0,178,4]]}
[{"$f":"NCOM&\" (\"&PCOM&\")\"","v":"Comune di Trescore Cremasco (CR)"},null,null,null,null,null,null,{"$f":"IF(INDEX(INT,1,13)=\"\",INDEX(INT,1,1),INDEX(INT,1,13))","v":"Piano di Emergenza Intercomunale di Protezione Civile"},null,null,null,null,null,null,null,null,null,null,null,{"$f":"IF(TIPOP=\"Edizione\",\"Ed. \",IF(TIPOP=\"Revisione\",\"Rev. \",\"Bozza \"))&TIPON&\" del \"&TIPOD","v":"Ed. 01 del 04/11/2012"}]
[]
[]
["Scheda Scenario",null,null,null,null,null,null,null,null,null,null,null,null,null,null,null,null,null,null,null,null,null,null,{"$f":"_IRI3","v":"IR.3"}]
[]
[{"$f":"IF(INDEX(IR3PAR,1,19)=\"\",INDEX(IR3PAR,1,12),INDEX(IR3PAR,1,19))","v":"Rischio di Incidente Rilevante/Trasporto di Sostanze Pericolose"}]
[]
[]
[null,"Paragrafi di Riferimento ",null,null,null,null,null,null,null,null,{"$f":"INDEX(IR3PAR,1,1)&INDEX(IR3PAR,1,12)","v":"2.2.5 - 3.3.5 Procedure per il Rischio di Incidente Rilevante"}]
[null,"Codice Scheda",null,null,null,null,null,null,null,null,{"$f":"X4","v":"IR.3"}]
[null,"Evento atteso",null,null,null,null,null,null,null,null,"Incidente in uno stabilimento o tra mezzi di trasporto che coinvolga sostanze chimiche pericolose e/o nocive alla salute. Incidente presso i distributori di carburante durante il trasbordo di benzina dall'autobotte al serbatoio dell'impianto."]
[]
[]
[]
[]
[null,"Attività U.C.L.",null,null,null,null,null,null,null,null,"Supporta e collabora col P.C.A. (Posto di Comando Avanzato), struttura guidata dal ROS dei VV.F. che gestisce in prima persona le operazioni di soccorso all'interno dell'area colpita."]
[]
[]
[]
[null,"Ubicazione intervento per i distributori di carburante",null,null,null,null,null,null,null,null,"Possone essere utilizzate le seguenti aree indicative presso i distributori:"]
[null,null,null,null,null,null,null,null,null,null,"Radiazione Termica",null,null,"Zona I",null,null,"ELEVATA LETALITA':",null,null,null,null,null,"35 m"]
[null,null,null,null,null,null,null,null,null,null,null,null,null,"Zona II",null,null,"LESIONI IRREVERSEBILI:",null,null,null,null,null,"60 m"]
[null,null,null,null,null,null,null,null,null,null,null,null,null,"Zona III",null,null,"LESIONI REVERSIBILI:",null,null,null,null,null,"70 m"]
[null,"Ubicazione intervento altre tipologie di incidente",null,null,null,null,null,null,null,null,"Aree limitrofe perimetrate in accordo con il PCA."]
[]
[null,"Personale mobilitato",null,null,null,null,null,null,null,null,{"$f":"IF(INDEX(IR3PER,1,1)=\"\",\"\",\"- \"&VLOOKUP(INDEX(IR3PER,1,1),Personale,IF(INDEX(Personale,INDEX(IR3PER,1,1),14)=\"\",2,14)))","v":"- Polizia Locale"},null,null,null,null,null,null,"Riportare la composizione delle squadre nel Modulo M1"]
[null,null,null,null,null,null,null,null,null,null,{"$f":"IF(INDEX(IR3PER,1,2)=\"\",\"\",\"- \"&VLOOKUP(INDEX(IR3PER,1,2),Personale,IF(INDEX(Personale,INDEX(IR3PER,1,2),14)=\"\",2,14)))","v":"- Volontari P.C."}]
[null,null,null,null,null,null,null,null,null,null,{"$f":"IF(INDEX(IR3PER,1,3)=\"\",\"\",\"- \"&VLOOKUP(INDEX(IR3PER,1,3),Personale,IF(INDEX(Personale,INDEX(IR3PER,1,3),14)=\"\",2,14)))","v":"- Tecnici/Operai Comunali"}]
[null,"Attività personale mobilitato",null,null,null,null,null,null,null,null,"Collaborazione con il PCA per il soccorso alla popolazione, in accordo al piano di emergenza comunale."]
[]
[]
[null,"Grado di coinvolgimento della popolazione",null,null,null,null,null,null,null,null,"Dipende dall'ampiezza della zona colpita. Si procede con il soccorrere le persone coivolte,  si informa la popolazione interessata e si evacuano le persone che si trovano nelle zone a maggior rischio."]
[]
[]
[null,null,null,null,null,null,null,null,null,null,"Registrare le persone eventualmente evacuate nel Modulo M2"]
[null,"Cancelli e vie alternative",null,null,null,null,null,null,null,null,"In accordo con quanto deciso dal PCA vengono posizionati dei cancelli finalizzati alla regolazione del traffico nelle zone interessate. "]
[]
[]
[null,"Aree di raccolta popolazione",null,null,null,{"$f":"IF(INDEX(IR3RIC,1,1)=\"\",\"In questa fase non è prevista l’attivazione di tali aree.\",\"Per questa emergenza \"&IF(INDEX(IR3RIC,1,2)=\"\",\"è disponibile la seguente area:\",\"sono disponibili le seguenti aree:\"))","v":"Per questa emergenza sono disponibili le seguenti aree:"}]
[null,null,null,null,null,{"$f":"IF(INDEX(IR3RIC,1,1)=\"\",\"\",\"- \"&VLOOKUP(INDEX(IR3RIC,1,1),Ricovero,2))","v":"- Centro Sportivo Comunale - Carta AE.41 - Trescore Cremasco - Ricovero/Tendopoli"}]
[null,null,null,null,null,{"$f":"IF(INDEX(IR3RIC,1,2)=\"\",\"\",\"- \"&VLOOKUP(INDEX(IR3RIC,1,2),Ricovero,2))","v":"- Scuola Secondaria di I Grado \"Manzoni\" - Carta AE.42 - Trescore Cremasco - Ricovero"}]
[null,null,null,null,null,{"$f":"IF(INDEX(IR3RIC,1,3)=\"\",\"\",\"- \"&VLOOKUP(INDEX(IR3RIC,1,3),Ricovero,2))","v":"- Scuola Primaria Trescore Cremasco - Carta AE.43 - Trescore Cremasco - Ricovero"}]
[null,"Area di ricovero",null,null,null,{"$f":"IF(INDEX(IR3RIC,1,4)=\"\",\"\",\"- \"&VLOOKUP(INDEX(IR3RIC,1,4),Ricovero,2))","v":""}]
[null,null,null,null,null,{"$f":"IF(INDEX(IR3RIC,1,5)=\"\",\"\",\"- \"&VLOOKUP(INDEX(IR3RIC,1,5),Ricovero,2))","v":""}]
[null,null,null,null,null,{"$f":"IF(INDEX(IR3RIC,1,6)=\"\",\"\",\"- \"&VLOOKUP(INDEX(IR3RIC,1,6),Ricovero,2))","v":""}]
[null,null,null,null,null,{"$f":"IF(INDEX(IR3RIC,1,7)=\"\",\"\",\"- \"&VLOOKUP(INDEX(IR3RIC,1,7),Ricovero,2))","v":""}]
[null,null,null,null,null,{"$f":"IF(F41=\"\",\"\",\"In funzione della gravità della situazione si decide quali/quante aree attivare.\")","v":"In funzione della gravità della situazione si decide quali/quante aree attivare."}]
[null,"Area di raduno soccorritori",null,null,null,"Il PCA è posizionato in funzione della localizzazione dell’incidente."]
[]
[null,"Ordinanze Necessarie",null,null,null,null,null,null,null,null,"Ordinanza di Evacuazione;"]
[null,null,null,null,null,null,null,null,null,null,"Ordinanza di Chiusura Strade."]
[null,"Modalita’ Riunione U.C.L.",null,null,null,null,null,null,null,null,null,"Non necessaria"]
[null,null,null,null,null,null,null,null,null,null,"X","Virtuale"]
[null,null,null,null,null,null,null,null,null,null,"X","In sede"]
[null,"Possibili Scenari Concomitanti",null,null,null,null,null,null,null,null,"Non ragionevolmente prevedibile la concomitanza con altri eventi."]
[]
[]
[]
[]
[null,"Contatti Utili",null,null,null,null,null,null,null,null,{"$f":"\"Consultare il \"&IF([1]Maschera!Z71=\"\",[1]Maschera!N71,[1]Maschera!Z71)","v":"Consultare il Tomo Giallo - Risorse"}]
[null,"Cartografia",null,null,null,null,null,null,null,null,{"$f":"INDEX(IR3PAR,1,28)","v":"Tav. 3/B - Rischio Industriale"}]
[null,null,null,null,null,null,null,null,null,null,{"$f":"INDEX(IR3PAR,1,39)","v":"Tav. 3/D - Stradario Piano di Emergenza"}]
[]
[{"$f":"Titolo2","v":"Procedure U.C.L."},null,null,null,null,null,null,null,null,null,null,null,null,null,null,null,null,null,null,null,null,null,null,{"$f":"_IRI3","v":"IR.3"}]
[]
[{"$f":"$A$6","v":"Rischio di Incidente Rilevante/Trasporto di Sostanze Pericolose"}]
[]
[]
[]
[]
[]
[]
[]
[]
[]
[]
[]
[]
[]
[]
[]
[]
[]
[]
[]
[]
[]
[]
[]
[]
[]
[]
[]
[]
[]
[]
[]
[]
[]
[]
[]
[]
[]
[]
[]
[]
[]
[]
[]
[]
[]
[]
[]
[]
[]
[]
[]
[]
[]
[]
[]
[]
[]
[{"$f":"Titolo2","v":"Procedure U.C.L."},null,null,null,null,null,null,null,null,null,null,null,null,null,null,null,null,null,null,null,null,null,null,{"$f":"X4","v":"IR.3"}]
[]
[{"$f":"$A$6","v":"Rischio di Incidente Rilevante/Trasporto di Sostanze Pericolose"}]
[]
[]
["RESPONSABILE",null,null,null,null,"AZIONE",null,null,null,null,null,"CHIAMATE"]
[null,null,null,null,null,null,null,null,null,null,null,"MEMBRO UCL",null,null,null,"OPERATIVI",null,null,null,"ENTE INTERESSATO",null,null,null,"SCHEDE RISORSE"]
[]
[{"$f":"IF(INDEX(PL,1,9)=\"\",INDEX(PL,1,1),INDEX(PL,1,9))","v":"POLIZIA LOCALE"},null,null,null,null,"Su segnalazione di cittadini o su segnalazione di incidente stradale effettua sopralluogo nell'area interessata.",null,null,null,null,null,{"$f":"\"- \"&PROPER(IF(INDEX(RT,1,9)=\"\",INDEX(RT,1,1),INDEX(RT,1,9)))","v":"- Resp. Territorio"},null,null,null,{"$f":"\"- \"&IF(INDEX(PLO,1,9)=\"\",INDEX(PLO,1,1),INDEX(PLO,1,9))","v":"- Agenti P.L."},null,null,null,"--"]
[null,null,null,null,null,null,null,null,null,null,null,null,null,null,null,null,null,null,null,null,null,null,null,"O1 - O2  A2.2"]
[]
[]
[{"$f":"IF(INDEX(RT,1,9)=\"\",INDEX(RT,1,1),INDEX(RT,1,9))","v":"RESP. TERRITORIO"},null,null,null,null,"Collabora nell'organizzazione del sopralluogo.",null,null,null,null,null,"--",null,null,null,{"$f":"\"- \"&IF(INDEX(TCO,1,9)=\"\",INDEX(TCO,1,1),INDEX(TCO,1,9))","v":"- Tecnici Comunali"},null,null,null,"--",null,null,null,"A2.1  B2  C3"]
[null,null,null,null,null,null,null,null,null,null,null,null,null,null,null,{"$f":"\"- \"&IF(INDEX(PTO,1,9)=\"\",INDEX(PTO,1,1),INDEX(PTO,1,9))","v":"- Professionisti"}]
["SE L'INCIDENTE COINVOLGE SOSTANZE CHIMICHE"]
[{"$f":"IF(INDEX(Sindaco,1,9)=\"\",INDEX(Sindaco,1,1),INDEX(Sindaco,1,9))","v":"SINDACO / R.O.C."},null,null,null,null,"Attiva l'UCL e avverte i VV.F. Manda il C.te della Polizia Locale o delegato a fare parte del PCA.",null,null,null,null,null,"- Tutti",null,null,null,null,null,null,null,{"$f":"\"- \"&IF(INDEX(REG,1,9)=\"\",INDEX(REG,1,1),INDEX(REG,1,9))","v":"- Regione"}]
[null,null,null,null,null,null,null,null,null,null,null,null,null,null,null,{"$f":"\"- \"&IF(INDEX(VF,1,9)=\"\",INDEX(VF,1,1),INDEX(VF,1,9))","v":"- VV.F."},null,null,null,{"$f":"\"- \"&IF(INDEX(REG,1,9)=\"\",INDEX(REG,1,1),INDEX(REG,1,9))","v":"- Regione"},null,null,null,"O1 - O2"]
[null,null,null,null,null,null,null,null,null,null,null,null,null,null,null,{"$f":"\"- \"&IF(INDEX(CRI,1,9)=\"\",INDEX(CRI,1,1),INDEX(CRI,1,9))","v":"- 118"},null,null,null,{"$f":"\"- \"&IF(INDEX(REG,1,9)=\"\",INDEX(REG,1,1),INDEX(REG,1,9))","v":"- Regione"},null,null,null,"C2.1  C2.4"]
[null,null,null,null,null,null,null,null,null,null,null,null,null,null,null,null,null,null,null,{"$f":"\"- \"&IF(INDEX(REG,1,9)=\"\",INDEX(REG,1,1),INDEX(REG,1,9))","v":"- Regione"}]
[{"$f":"IF(INDEX(PL,1,9)=\"\",INDEX(PL,1,1),INDEX(PL,1,9))","v":"POLIZIA LOCALE"},null,null,null,null,{"$f":"\"In accordo con il PCA organizza cancelli per il traffico e informa la popolazione. \"&_IRI3&\".1\"","v":"In accordo con il PCA organizza cancelli per il traffico e informa la popolazione. IR.3.1"},null,null,null,null,null,{"$f":"\"- \"&PROPER(IF(INDEX(Sindaco,1,9)=\"\",INDEX(Sindaco,1,1),INDEX(Sindaco,1,9)))","v":"- Sindaco / R.O.C."},null,null,null,{"$f":"\"- \"&IF(INDEX(PLO,1,9)=\"\",INDEX(PLO,1,1),INDEX(PLO,1,9))","v":"- Agenti P.L."},null,null,null,"--",null,null,null,"O1 - O2  A2.2",null,null,{"$f":"_IRI3&\".1\"","v":"IR.3.1"}]
[]
[]
[]
[{"$f":"IF(INDEX(CV,1,9)=\"\",INDEX(CV,1,1),INDEX(CV,1,9))","v":"C. VOLONTARIATO"},null,null,null,null,{"$f":"\"Coadiuva \"&_IRI3&\".1\"","v":"Coadiuva IR.3.1"},null,null,null,null,null,"--",null,null,null,{"$f":"\"- \"&IF(INDEX(VO,1,9)=\"\",INDEX(VO,1,1),INDEX(VO,1,9))","v":"- Gruppi Volontari"},null,null,null,"--",null,null,null,"A3 - B3"]
[{"$f":"IF(INDEX(RT,1,9)=\"\",INDEX(RT,1,1),INDEX(RT,1,9))","v":"RESP. TERRITORIO"},null,null,null,null,"Su richiesta del PCA sospende l'erogazionedei servizi essenziali",null,null,null,null,null,"--",null,null,null,{"$f":"\"- \"&IF(INDEX(TCO,1,9)=\"\",INDEX(TCO,1,1),INDEX(TCO,1,9))","v":"- Tecnici Comunali"},null,null,null,"--",null,null,null,"A2.1  C1"]
[null,null,null,null,null,null,null,null,null,null,null,null,null,null,null,{"$f":"\"- \"&IF(INDEX(GEE,1,9)=\"\",INDEX(GEE,1,1),INDEX(GEE,1,9))","v":"- Gestore Elettricità"}]
[null,null,null,null,null,null,null,null,null,null,null,null,null,null,null,{"$f":"\"- \"&IF(INDEX(GEG,1,9)=\"\",INDEX(GEG,1,1),INDEX(GEG,1,9))","v":"- Gestore Gas"}]
[null,null,null,null,null,null,null,null,null,null,null,null,null,null,null,{"$f":"\"- \"&IF(INDEX(GEA,1,9)=\"\",INDEX(GEA,1,1),INDEX(GEA,1,9))","v":"- Gestore Acquedotto"}]
["SE VI E' RISCHIO PER LA SALUTE PUBBLICA"]
[{"$f":"IF(INDEX(Sindaco,1,9)=\"\",INDEX(Sindaco,1,1),INDEX(Sindaco,1,9))","v":"SINDACO / R.O.C."},null,null,null,null,{"$f":"\"In accordo col PCA attiva le aree di emergenza (\"&_IRI3&\".2),\"&\" e dispone le evacuazioni.  (\"&_IRI3&\".3).\"","v":"In accordo col PCA attiva le aree di emergenza (IR.3.2), e dispone le evacuazioni.  (IR.3.3)."},null,null,null,null,null,null,null,null,null,"--",null,null,null,{"$f":"\"- \"&IF(INDEX(PR,1,9)=\"\",INDEX(PR,1,1),INDEX(PR,1,9))","v":"- Prefettura"}]
[null,null,null,null,null,null,null,null,null,null,null,{"$f":"\"- \"&PROPER(IF(INDEX(PL,1,9)=\"\",INDEX(PL,1,1),INDEX(PL,1,9)))","v":"- Polizia Locale"},null,null,null,null,null,null,null,{"$f":"\"- \"&IF(INDEX(PRO,1,9)=\"\",INDEX(PRO,1,1),INDEX(PRO,1,9))","v":"- Provincia"},null,null,null,"O1 - O2"]
[null,null,null,null,null,null,null,null,null,null,null,{"$f":"\"- \"&PROPER(IF(INDEX(RT,1,9)=\"\",INDEX(RT,1,1),INDEX(RT,1,9)))","v":"- Resp. Territorio"},null,null,null,null,null,null,null,{"$f":"\"- \"&IF(INDEX(REG,1,9)=\"\",INDEX(REG,1,1),INDEX(REG,1,9))","v":"- Regione"},null,null,null,"C2.1","C2.3","C2.4",{"$f":"_IRI3&\".2\"","v":"IR.3.2"}]
[]
[{"$f":"IF(INDEX(RT,1,9)=\"\",INDEX(RT,1,1),INDEX(RT,1,9))","v":"RESP. TERRITORIO"},null,null,null,null,{"$f":"\"Responsabile \"&_IRI3&\".2\"","v":"Responsabile IR.3.2"},null,null,null,null,null,null,null,null,null,{"$f":"\"- \"&IF(INDEX(TCO,1,9)=\"\",INDEX(TCO,1,1),INDEX(TCO,1,9))","v":"- Tecnici Comunali"},null,null,null,"--",null,null,null,"O1 - O2",null,"A2.1"]
[null,null,null,null,null,null,null,null,null,null,null,{"$f":"\"- \"&PROPER(IF(INDEX(CV,1,9)=\"\",INDEX(CV,1,1),INDEX(CV,1,9)))","v":"- C. Volontariato"},null,null,null,null,null,null,null,null,null,null,null,"A4","A5","A6"]
[null,null,null,null,null,null,null,null,null,null,null,{"$f":"\"- \"&PROPER(IF(INDEX(RSS,1,9)=\"\",INDEX(RSS,1,1),INDEX(RSS,1,9)))","v":"- Resp. Serv. Sociali"},null,null,null,null,null,null,null,null,null,null,null,"A7.1","A7.2","B5"]
[null,null,null,null,null,null,null,null,null,null,null,null,null,null,null,null,null,null,null,null,null,null,null,"B6","C1","C3"]
[{"$f":"IF(INDEX(CV,1,9)=\"\",INDEX(CV,1,1),INDEX(CV,1,9))","v":"C. VOLONTARIATO"},null,null,null,null,{"$f":"\"Coadiuva \"&_IRI3&\".2\"","v":"Coadiuva IR.3.2"},null,null,null,null,null,"--",null,null,null,{"$f":"\"- \"&IF(INDEX(VO,1,9)=\"\",INDEX(VO,1,1),INDEX(VO,1,9))","v":"- Gruppi Volontari"},null,null,null,"--",null,null,null,"A3 - B3"]
[{"$f":"IF(INDEX(RSS,1,9)=\"\",INDEX(RSS,1,1),INDEX(RSS,1,9))","v":"RESP. SERV. SOCIALI"},null,null,null,null,{"$f":"\"Coadiuva \"&_IRI3&\".2\"","v":"Coadiuva IR.3.2"},null,null,null,null,null,"--",null,null,null,{"$f":"\"- \"&IF(INDEX(SO,1,9)=\"\",INDEX(SO,1,1),INDEX(SO,1,9))","v":"- Pers. Sanitario"},null,null,null,"--",null,null,null,"B1 - C2.2 - D1 "]
[{"$f":"IF(INDEX(PL,1,9)=\"\",INDEX(PL,1,1),INDEX(PL,1,9))","v":"POLIZIA LOCALE"},null,null,null,null,{"$f":"\"Responsabile \"&_IRI3&\".3\"","v":"Responsabile IR.3.3"},null,null,null,null,null,{"$f":"\"- \"&PROPER(IF(INDEX(CV,1,9)=\"\",INDEX(CV,1,1),INDEX(CV,1,9)))","v":"- C. Volontariato"},null,null,null,{"$f":"\"- \"&IF(INDEX(PLO,1,9)=\"\",INDEX(PLO,1,1),INDEX(PLO,1,9))","v":"- Agenti P.L."},null,null,null,"--",null,null,null,"O1 - O2  A2.2",null,null,{"$f":"_IRI3&\".3\"","v":"IR.3.3"}]
[null,null,null,null,null,null,null,null,null,null,null,{"$f":"\"- \"&PROPER(IF(INDEX(CC,1,9)=\"\",INDEX(CC,1,1),INDEX(CC,1,9)))","v":"- C. Carabinieri"},null,null,null,null,null,null,null,null,null,null,null,"M2","D2"]
[{"$f":"IF(INDEX(CV,1,9)=\"\",INDEX(CV,1,1),INDEX(CV,1,9))","v":"C. VOLONTARIATO"},null,null,null,null,{"$f":"\"Coadiuva \"&_IRI3&\".3\"","v":"Coadiuva IR.3.3"},null,null,null,null,null,"--",null,null,null,{"$f":"\"- \"&IF(INDEX(VO,1,9)=\"\",INDEX(VO,1,1),INDEX(VO,1,9))","v":"- Gruppi Volontari"},null,null,null,"--",null,null,null,"A3 - B3"]
[{"$f":"IF(INDEX(CC,1,9)=\"\",INDEX(CC,1,1),INDEX(CC,1,9))","v":"C. CARABINIERI"},null,null,null,null,{"$f":"\"Coadiuva \"&_IRI3&\".3\"","v":"Coadiuva IR.3.3"},null,null,null,null,null,"--",null,null,null,{"$f":"\"- \"&IF(INDEX(CO,1,9)=\"\",INDEX(CO,1,1),INDEX(CO,1,9))","v":"- Carabinieri"},null,null,null,"--",null,null,null,"--"]
[{"$f":"IF(INDEX(Sindaco,1,9)=\"\",INDEX(Sindaco,1,1),INDEX(Sindaco,1,9))","v":"SINDACO / R.O.C."},null,null,null,null,"Informa periodicamente gli enti sovraordinati e i media su quanto fatto.",null,null,null,null,null,"--",null,null,null,"--",null,null,null,{"$f":"\"- \"&IF(INDEX(PR,1,9)=\"\",INDEX(PR,1,1),INDEX(PR,1,9))","v":"- Prefettura"}]
[null,null,null,null,null,null,null,null,null,null,null,null,null,null,null,null,null,null,null,{"$f":"\"- \"&IF(INDEX(PRO,1,9)=\"\",INDEX(PRO,1,1),INDEX(PRO,1,9))","v":"- Provincia"},null,null,null,"C2.1","C2.3","C2.4"]
[null,null,null,null,null,null,null,null,null,null,null,null,null,null,null,null,null,null,null,{"$f":"\"- \"&IF(INDEX(REG,1,9)=\"\",INDEX(REG,1,1),INDEX(REG,1,9))","v":"- Regione"}]
[{"$f":"IF(INDEX(PL,1,9)=\"\",INDEX(PL,1,1),INDEX(PL,1,9))","v":"POLIZIA LOCALE"},null,null,null,null,"A seguito di nulla-osta del PCA collabora nelle operazioni di soccorso",null,null,null,null,null,{"$f":"\"- \"&PROPER(IF(INDEX(CV,1,9)=\"\",INDEX(CV,1,1),INDEX(CV,1,9)))","v":"- C. Volontariato"},null,null,null,{"$f":"\"- \"&IF(INDEX(PLO,1,9)=\"\",INDEX(PLO,1,1),INDEX(PLO,1,9))","v":"- Agenti P.L."},null,null,null,"--",null,null,null,"O1 - O2  A2.2"]
[]
[]
[{"$f":"IF(INDEX(CV,1,9)=\"\",INDEX(CV,1,1),INDEX(CV,1,9))","v":"C. VOLONTARIATO"},null,null,null,null,"A seguito di nulla-osta del PCA collabora nelle operazioni di soccorso",null,null,null,null,null,{"$f":"\"- \"&PROPER(IF(INDEX(PL,1,9)=\"\",INDEX(PL,1,1),INDEX(PL,1,9)))","v":"- Polizia Locale"},null,null,null,{"$f":"\"- \"&IF(INDEX(VO,1,9)=\"\",INDEX(VO,1,1),INDEX(VO,1,9))","v":"- Gruppi Volontari"},null,null,null,"--",null,null,null,"O1 - O2"]
[null,null,null,null,null,null,null,null,null,null,null,null,null,null,null,null,null,null,null,null,null,null,null,"A3 - B3"]
[]
["AD INTERVENTI DI MITIGAZIONE E MESSA IN SICUREZZA AVVENUTI"]
[{"$f":"IF(INDEX(Sindaco,1,9)=\"\",INDEX(Sindaco,1,1),INDEX(Sindaco,1,9))","v":"SINDACO / R.O.C."},null,null,null,null,{"$f":"\"Informa sulla revoca dello Stato di Emergenza e ordina il rientro degli sfollati/informa la popolazione coinvolta. \"&_IRI3&\".4\"","v":"Informa sulla revoca dello Stato di Emergenza e ordina il rientro degli sfollati/informa la popolazione coinvolta. IR.3.4"},null,null,null,null,null,"- Tutti",null,null,null,{"$f":"\"- \"&IF(INDEX(SC,1,9)=\"\",INDEX(SC,1,1),INDEX(SC,1,9))","v":"- Squadre Operativi"},null,null,null,{"$f":"\"- \"&IF(INDEX(PR,1,9)=\"\",INDEX(PR,1,1),INDEX(PR,1,9))","v":"- Prefettura"},null,null,null,"O1 - O2",null,null,{"$f":"_IRI3&\".4\"","v":"IR.3.4"}]
[null,null,null,null,null,null,null,null,null,null,null,null,null,null,null,null,null,null,null,{"$f":"\"- \"&IF(INDEX(PRO,1,9)=\"\",INDEX(PRO,1,1),INDEX(PRO,1,9))","v":"- Provincia"},null,null,null,"C2.1","C2.3","C2.4"]
[null,null,null,null,null,null,null,null,null,null,null,null,null,null,null,null,null,null,null,{"$f":"\"- \"&IF(INDEX(REG,1,9)=\"\",INDEX(REG,1,1),INDEX(REG,1,9))","v":"- Regione"},null,null,null,"M1","M2"]
["MEMBRI U.C.L"]
[]
["PER LE COMUNICAZIONI EVIDENZIATE IN ROSSO UTILIZZARE IL MODULO FAX M4"]
[]
[{"$f":"Titolo3","v":"Scheda Procedura Operativa"},null,null,null,null,null,null,null,null,null,null,null,null,null,null,null,null,null,null,null,null,null,null,{"$f":"$X$4","v":"IR.3"}]
[]
[{"$f":"$A$6","v":"Rischio di Incidente Rilevante/Trasporto di Sostanze Pericolose"}]
[]
[]
[null,"Codice Scheda Scenario",null,null,null,null,null,{"$f":"$X$4","v":"IR.3"}]
[null,"Tipo di Procedure",null,null,null,null,null,{"$f":"_IRI3&\".1 \"&_IRI3&\".2 \"&_IRI3&\".3 \"&_IRI3&\".4 - AZIONI DI SALVAGUARDIA\"","v":"IR.3.1 IR.3.2 IR.3.3 IR.3.4 - AZIONI DI SALVAGUARDIA"}]
[null,"Ubicazione intervento",null,null,null,null,null," --"]
[null,"Aree di raccolta popolazione",null,null,null,null,null,{"$f":"IF(INDEX(IR3RIC,1,1)=\"\",\"In questa fase non è prevista l’attivazione di tali aree.\",\"Per questa emergenza \"&IF(INDEX(IR3RIC,1,2)=\"\",\"è disponibile la seguente area:\",\"sono disponibili le seguenti aree:\"))","v":"Per questa emergenza sono disponibili le seguenti aree:"}]
[null,null,null,null,null,null,null,{"$f":"IF(INDEX(IR3RIC,1,1)=\"\",\"\",\"- \"&VLOOKUP(INDEX(IR3RIC,1,1),Ricovero,2))","v":"- Centro Sportivo Comunale - Carta AE.41 - Trescore Cremasco - Ricovero/Tendopoli"}]
[null,null,null,null,null,null,null,{"$f":"IF(INDEX(IR3RIC,1,2)=\"\",\"\",\"- \"&VLOOKUP(INDEX(IR3RIC,1,2),Ricovero,2))","v":"- Scuola Secondaria di I Grado \"Manzoni\" - Carta AE.42 - Trescore Cremasco - Ricovero"}]
[null,null,null,null,null,null,null,{"$f":"IF(INDEX(IR3RIC,1,3)=\"\",\"\",\"- \"&VLOOKUP(INDEX(IR3RIC,1,3),Ricovero,2))","v":"- Scuola Primaria Trescore Cremasco - Carta AE.43 - Trescore Cremasco - Ricovero"}]
[null,"Area di ricovero",null,null,null,null,null,{"$f":"IF(INDEX(IR3RIC,1,4)=\"\",\"\",\"- \"&VLOOKUP(INDEX(IR3RIC,1,4),Ricovero,2))","v":""}]
[null,null,null,null,null,null,null,{"$f":"IF(INDEX(IR3RIC,1,5)=\"\",\"\",\"- \"&VLOOKUP(INDEX(IR3RIC,1,5),Ricovero,2))","v":""}]
[null,null,null,null,null,null,null,{"$f":"IF(INDEX(IR3RIC,1,6)=\"\",\"\",\"- \"&VLOOKUP(INDEX(IR3RIC,1,6),Ricovero,2))","v":""}]
[null,null,null,null,null,null,null,{"$f":"IF(INDEX(IR3RIC,1,7)=\"\",\"\",\"- \"&VLOOKUP(INDEX(IR3RIC,1,7),Ricovero,2))","v":""}]
[null,null,null,null,null,null,null,{"$f":"IF(H194=\"\",\"\",\"In funzione della gravità della situazione si decide quali/quante aree attivare.\")","v":"In funzione della gravità della situazione si decide quali/quante aree attivare."}]
[null,"Area di raduno soccorritori",null,null,null,null,null,{"$f":"$F$48","v":"Il PCA è posizionato in funzione della localizzazione dell’incidente."}]
[]
[]
[]
[]
[null,"Cancelli e vie alternative",null,null,null,null,null," --"]
[]
[null,"Contatti Utili",null,null,null,null,null,"Si faccia riferimento al PRONTUARIO DI EMERGENZA - CONTATTI"]
[]
[]
[]
[]
[null,null,"Procedura Operativa Standard (POS)",null,null,null,null,null,null,null,null,null,null,null,null,null,"Procedure Previste"]
[null,null,null,null,null,null,null,null,null,null,null,null,null,null,null,null,{"$f":"MID(H190,1,6)","v":"IR.3.1"},null,{"$f":"MID(H190,8,6)","v":"IR.3.2"},null,{"$f":"MID(H190,15,6)","v":"IR.3.3"},null,{"$f":"MID(H190,22,6)","v":"IR.3.4"}]
[null,null,1,"Monitoraggio",null,null,null,null,null,null,null,null,null,null,null,null,"--",null,"--",null,"--",null,"--"]
[null,null,2,"Perlustrazione",null,null,null,null,null,null,null,null,null,null,null,null,"--",null,"--",null,"--",null,"--"]
[null,null,3,"Presidio Cancelli/Supporto Viabilità",null,null,null,null,null,null,null,null,null,null,null,null,"X",null,"--",null,"--",null,"--"]
[null,null,4,"Informazione Diretta alla Popolazione",null,null,null,null,null,null,null,null,null,null,null,null,"X",null,"--",null,"--",null,"X"]
[null,null,5,"Allestimento Area di Ricovero",null,null,null,null,null,null,null,null,null,null,null,null,"--",null,"X",null,"--",null,"--"]
[null,null,6,"Allestimento Area di Ammassamento Soccorsi",null,null,null,null,null,null,null,null,null,null,null,null,"--",null,"--",null,"--",null,"--"]
[null,null,7,"Evacuazione",null,null,null,null,null,null,null,null,null,null,null,null,"--",null,"--",null,"X",null,"--"]
[null,null,8,"Rimozione Ostacoli",null,null,null,null,null,null,null,null,null,null,null,null,"--",null,"--",null,"--",null,"--"]
[null,null,9,"Rimozione Ostacoli da Alveo",null,null,null,null,null,null,null,null,null,null,null,null,"--",null,"--",null,"--",null,"--"]
[null,null,10,"Preservazione Argini",null,null,null,null,null,null,null,null,null,null,null,null,"--",null,"--",null,"--",null,"--"]
[null,null,11,"Frana",null,null,null,null,null,null,null,null,null,null,null,null,"--",null,"--",null,"--",null,"--"]

{"sheet":"RG_2","index":9,"n_rows":225,"n_cols":27,"rows_kept":225,"cut":false,"hidden":false,"merged":[[195,1,199,6],[195,7,195,24],[196,7,196,24],[197,7,197,24],[198,7,198,24],[199,7,199,24],[200,1,204,6],[189,1,189,6],[189,7,189,24],[190,1,190,6],[190,7,190,24],[191,1,194,6],[191,7,191,24],[192,7,192,24],[193,7,193,24],[194,7,194,24],[44,1,46,4],[44,5,46,24],[188,1,188,6],[188,7,188,24],[123,0,124,22],[123,23,126,25],[125,0,126,22],[47,1,49,9],[47,10,47,24],[48,10,48,24],[49,10,49,24],[50,1,52,9],[59,10,59,24],[53,1,57,9],[53,10,57,24],[58,1,58,9],[58,10,58,24],[50,11,50,24],[51,11,51,24],[52,11,52,24],[63,0,64,22],[63,23,66,25],[65,0,66,22],[131,0,133,4],[0,0,1,6],[0,7,1,18],[0,19,1,25],[3,0,4,22],[3,23,6,25],[5,0,6,22],[21,1,23,9],[8,1,8,9],[8,10,8,24],[9,1,9,9],[9,10,9,24],[10,1,14,9],[10,10,14,24],[15,1,18,9],[15,10,18,24],[19,1,20,9],[19,10,20,24],[21,17,23,24],[21,10,21,16],[22,10,22,16],[23,10,23,16],[24,1,27,9],[24,10,27,24],[28,1,31,9],[32,1,34,9],[32,10,34,24],[28,10,30,24],[31,10,31,24],[35,1,38,4],[39,1,43,4],[35,5,35,24],[36,5,36,24],[37,5,37,24],[38,5,38,24],[39,5,39,24],[40,5,40,24],[41,5,41,24],[42,5,42,24],[43,5,43,24],[131,5,133,10],[131,11,133,14],[131,15,131,18],[131,19,133,22],[132,15,132,18],[133,15,133,18],[128,0,130,4],[128,5,130,10],[128,11,128,25],[129,11,130,14],[129,15,130,18],[129,19,130,22],[129,23,130,25],[131,23,131,25],[132,23,132,25],[134,0,137,4],[134,5,137,10],[134,11,137,14],[134,15,134,18],[134,19,137,22],[134,23,137,25],[135,15,135,18],[136,15,136,18],[137,15,137,18],[138,26,142,26],[139,15,139,18],[140,15,140,18],[141,15,141,18],[142,0,142,4],[142,5,142,10],[142,11,142,14],[142,15,142,18],[142,19,142,22],[142,23,142,25],[138,0,141,4],[138,5,141,10],[138,11,141,14],[138,15,138,18],[138,19,141,22],[139,23,139,25],[140,23,140,25],[146,0,148,4],[146,5,148,10],[146,11,148,14],[146,15,146,18],[146,19,148,22],[146,23,148,25],[147,15,147,18],[148,15,148,18],[143,0,143,25],[144,0,145,4],[144,5,145,10],[144,11,145,14],[144,15,145,18],[144,19,145,22],[144,23,145,25],[159,0,159,4],[159,5,159,10],[159,11,159,14],[159,15,159,18],[149,0,154,4],[149,5,154,10],[149,15,154,18],[150,19,150,22],[151,11,151,14],[151,19,151,22],[152,11,152,14],[152,19,152,22],[155,0,158,4],[155,5,158,10],[155,15,158,18],[155,19,158,22],[159,19,159,22],[163,5,163,10],[163,11,163,14],[163,15,163,18],[163,19,163,22],[163,23,163,25],[164,0,164,4],[164,5,164,10],[161,11,161,14],[161,15,162,18],[161,19,162,22],[164,11,164,14],[164,15,164,18],[164,19,164,22],[164,23,164,25],[161,23,161,25],[152,26,160,26],[183,0,184,22],[183,23,186,25],[185,0,186,22],[173,0,173,25],[159,23,159,25],[160,0,160,4],[212,2,213,14],[212,15,212,23],[213,15,213,17],[205,1,206,6],[205,7,206,24],[207,1,208,6],[207,7,208,24],[200,7,204,24],[160,11,160,14],[160,15,160,18],[160,19,160,22],[160,23,160,25],[156,11,156,14],[157,11,157,14],[161,26,164,26],[162,11,162,14],[163,0,163,4],[215,15,215,17],[215,18,215,20],[215,21,215,23],[213,18,213,20],[213,21,213,23],[214,3,214,14],[215,3,215,14],[216,3,216,14],[214,15,214,17],[214,18,214,20],[214,21,214,23],[216,15,216,17],[216,18,216,20],[216,21,216,23],[217,3,217,14],[218,3,218,14],[219,3,219,14],[223,15,223,17],[221,15,221,17],[222,15,222,17],[223,18,223,20],[223,21,223,23],[217,18,217,20],[217,21,217,23],[218,15,218,17],[218,18,218,20],[218,21,218,23],[222,18,222,20],[222,21,222,23],[219,15,219,17],[219,18,219,20],[219,21,219,23],[217,15,217,17],[220,15,220,17],[224,15,224,17],[224,18,224,20],[224,21,224,23],[220,3,220,14],[221,3,221,14],[222,3,222,14],[223,3,223,14],[224,3,224,14],[220,18,220,20],[220,21,220,23],[221,18,221,20],[221,21,221,23],[151,23,151,25],[155,23,155,24],[169,23,169,25],[60,10,60,24],[59,1,60,9],[165,0,167,4],[165,5,167,10],[165,11,167,14],[165,15,167,18],[165,19,165,22],[166,19,166,22],[167,19,167,22],[168,0,168,25],[169,0,170,4],[169,5,171,10],[169,11,171,14],[169,15,171,18],[169,19,169,22],[170,19,170,22],[171,0,171,4],[171,19,171,22],[161,0,162,4],[161,5,162,10],[160,5,160,10]]}
[{"$f":"NCOM&\" (\"&PCOM&\")\"","v":"Comune di Trescore Cremasco (CR)"},null,null,null,null,null,null,{"$f":"IF(INDEX(INT,1,13)=\"\",INDEX(INT,1,1),INDEX(INT,1,13))","v":"Piano di Emergenza Intercomunale di Protezione Civile"},null,null,null,null,null,null,null,null,null,null,null,{"$f":"IF(TIPOP=\"Edizione\",\"Ed. \",IF(TIPOP=\"Revisione\",\"Rev. \",\"Bozza \"))&TIPON&\" del \"&TIPOD","v":"Ed. 01 del 04/11/2012"}]
[]
[]
["Scheda Scenario",null,null,null,null,null,null,null,null,null,null,null,null,null,null,null,null,null,null,null,null,null,null,{"$f":"_RG2","v":"RG.2"}]
[]
[{"$f":"IF(INDEX(RG2PAR,1,19)=\"\",INDEX(RG2PAR,1,12),INDEX(RG2PAR,1,19))&\" - Fase di Allarme\"","v":"Rischio di Incidente Rete Metano - Fase di Allarme"}]
[]
[]
[null,"Paragrafi di Riferimento ",null,null,null,null,null,null,null,null,{"$f":"INDEX(IR3PAR,1,1)&INDEX(IR3PAR,1,12)","v":"2.2.5 - 3.3.5 Procedure per il Rischio di Incidente Rilevante"}]
[null,"Codice Scheda",null,null,null,null,null,null,null,null,{"$f":"X4","v":"RG.2"}]
[null,"Evento atteso",null,null,null,null,null,null,null,null,"Perdita di gas in abitazioni o lungo la rete di distribuzione.  "]
[]
[]
[]
[]
[null,"Attività U.C.L.",null,null,null,null,null,null,null,null,"Supporta e collabora con il R.O.S. dei VV.F. che gestisce in prima persona le operazioni di soccorso nell'ambito dell'area interessata dalla perdita di gas."]
[]
[]
[]
[null,"Ubicazione intervento",null,null,null,null,null,null,null,null,"Aree limitrofe all'incidente."]
[]
[null,"Personale mobilitato",null,null,null,null,null,null,null,null,{"$f":"IF(INDEX(RG2PER,1,1)=\"\",\"\",\"- \"&VLOOKUP(INDEX(RG2PER,1,1),Personale,IF(INDEX(Personale,INDEX(RG2PER,1,1),14)=\"\",2,14)))","v":"- Polizia Locale"},null,null,null,null,null,null,"Riportare la composizione delle squadre nel Modulo M1"]
[null,null,null,null,null,null,null,null,null,null,{"$f":"IF(INDEX(RG2PER,1,2)=\"\",\"\",\"- \"&VLOOKUP(INDEX(RG2PER,1,2),Personale,IF(INDEX(Personale,INDEX(RG2PER,1,2),14)=\"\",2,14)))","v":"- Volontari P.C."}]
[null,null,null,null,null,null,null,null,null,null,{"$f":"IF(INDEX(RG2PER,1,3)=\"\",\"\",\"- \"&VLOOKUP(INDEX(RG2PER,1,3),Personale,IF(INDEX(Personale,INDEX(RG2PER,1,3),14)=\"\",2,14)))","v":"- Tecnici/Operai Comunali"}]
[null,"Attività personale mobilitato",null,null,null,null,null,null,null,null,"Collaborazione con i VV.F. per il soccorso alla popolazione, in accordo al piano di emergenza comunale."]
[]
[]
[]
[null,"Grado di coinvolgimento della popolazione",null,null,null,null,null,null,null,null,"Dipende dall'ampiezza della zona colpita. Si procede con l'informare la popolazione interessata sulle precauzioni da prendere e si evacuano le persone che si trovano nelle zone a maggior rischio."]
[]
[]
[null,null,null,null,null,null,null,null,null,null,"Registrare le persone eventualmente evacuate nel Modulo M2"]
[null,"Cancelli e vie alternative",null,null,null,null,null,null,null,null,"In accordo con il ROS vengono posizionati dei cancelli finalizzati alla regolazione del traffico nelle zone interessate."]
[]
[]
[null,"Aree di raccolta popolazione",null,null,null,{"$f":"IF(INDEX(RG2RIC,1,1)=\"\",\"In questa fase non è prevista l’attivazione di tali aree.\",\"Per questa emergenza \"&IF(INDEX(RG2RIC,1,2)=\"\",\"è disponibile la seguente area:\",\"sono disponibili le seguenti aree:\"))","v":"Per questa emergenza sono disponibili le seguenti aree:"}]
[null,null,null,null,null,{"$f":"IF(INDEX(RG2RIC,1,1)=\"\",\"\",\"- \"&VLOOKUP(INDEX(RG2RIC,1,1),Ricovero,2))","v":"- Centro Sportivo Comunale - Carta AE.41 - Trescore Cremasco - Ricovero/Tendopoli"}]
[null,null,null,null,null,{"$f":"IF(INDEX(RG2RIC,1,2)=\"\",\"\",\"- \"&VLOOKUP(INDEX(RG2RIC,1,2),Ricovero,2))","v":"- Scuola Secondaria di I Grado \"Manzoni\" - Carta AE.42 - Trescore Cremasco - Ricovero"}]
[null,null,null,null,null,{"$f":"IF(INDEX(RG2RIC,1,3)=\"\",\"\",\"- \"&VLOOKUP(INDEX(RG2RIC,1,3),Ricovero,2))","v":"- Scuola Primaria Trescore Cremasco - Carta AE.43 - Trescore Cremasco - Ricovero"}]
[null,"Area di ricovero",null,null,null,{"$f":"IF(INDEX(RG2RIC,1,4)=\"\",\"\",\"- \"&VLOOKUP(INDEX(RG2RIC,1,4),Ricovero,2))","v":""}]
[null,null,null,null,null,{"$f":"IF(INDEX(RG2RIC,1,5)=\"\",\"\",\"- \"&VLOOKUP(INDEX(RG2RIC,1,5),Ricovero,2))","v":""}]
[null,null,null,null,null,{"$f":"IF(INDEX(RG2RIC,1,6)=\"\",\"\",\"- \"&VLOOKUP(INDEX(RG2RIC,1,6),Ricovero,2))","v":""}]
[null,null,null,null,null,{"$f":"IF(INDEX(RG2RIC,1,7)=\"\",\"\",\"- \"&VLOOKUP(INDEX(RG2RIC,1,7),Ricovero,2))","v":""}]
[null,null,null,null,null,{"$f":"IF(F38=\"\",\"\",\"In funzione della gravità della situazione si decide quali/quante aree attivare.\")","v":"In funzione della gravità della situazione si decide quali/quante aree attivare."}]
[null,"Area di raduno soccorritori",null,null,null,"Viene scelta e sgomberata in funzione della localizzazione dell'incidente."]
[]
[]
[null,"Ordinanze Necessarie",null,null,null,null,null,null,null,null,"Ordinanza di Evacuazione;"]
[null,null,null,null,null,null,null,null,null,null,"Ordinanza di Chiusura Strade."]
[]
[null,"Modalita’ Riunione U.C.L.",null,null,null,null,null,null,null,null,null,"Non necessaria"]
[null,null,null,null,null,null,null,null,null,null,"X","Virtuale"]
[null,null,null,null,null,null,null,null,null,null,"X","In sede"]
[null,"Possibili Scenari Concomitanti",null,null,null,null,null,null,null,null,"Non ragionevolmente prevedibile la concomitanza con altri eventi."]
[]
[]
[]
[]
[null,"Contatti Utili",null,null,null,null,null,null,null,null,{"$f":"\"Consultare il \"&IF([1]Maschera!Z71=\"\",[1]Maschera!N71,[1]Maschera!Z71)","v":"Consultare il Tomo Giallo - Risorse"}]
[null,"Cartografia",null,null,null,null,null,null,null,null,{"$f":"INDEX(RG2PAR,1,28)","v":"Tav. 3/B - Rischio Industriale"}]
[null,null,null,null,null,null,null,null,null,null,{"$f":"INDEX(RG2PAR,1,39)","v":"Tav. 3/D - Stradario Piano di Emergenza"}]
[]
[]
[{"$f":"Titolo2","v":"Procedure U.C.L."},null,null,null,null,null,null,null,null,null,null,null,null,null,null,null,null,null,null,null,null,null,null,{"$f":"_RG2","v":"RG.2"}]
[]
[{"$f":"$A$6","v":"Rischio di Incidente Rete Metano - Fase di Allarme"}]
[]
[]
[]
[]
[]
[]
[]
[]
[]
[]
[]
[]
[]
[]
[]
[]
[]
[]
[]
[]
[]
[]
[]
[]
[]
[]
[]
[]
[]
[]
[]
[]
[]
[]
[]
[]
[]
[]
[]
[]
[]
[]
[]
[]
[]
[]
[]
[]
[]
[]
[]
[]
[]
[]
[]
[]
[]
[{"$f":"Titolo2","v":"Procedure U.C.L."},null,null,null,null,null,null,null,null,null,null,null,null,null,null,null,null,null,null,null,null,null,null,{"$f":"X4","v":"RG.2"}]
[]
[{"$f":"$A$6","v":"Rischio di Incidente Rete Metano - Fase di Allarme"}]
[]
[]
["RESPONSABILE",null,null,null,null,"AZIONE",null,null,null,null,null,"CHIAMATE"]
[null,null,null,null,null,null,null,null,null,null,null,"MEMBRO UCL",null,null,null,"OPERATIVI",null,null,null,"ENTE INTERESSATO",null,null,null,"SCHEDE RISORSE"]
[]
[{"$f":"IF(INDEX(PL,1,9)=\"\",INDEX(PL,1,1),INDEX(PL,1,9))","v":"POLIZIA LOCALE"},null,null,null,null,"Effettua sopralluogo nell'area interessata e avvisa i VV.F.",null,null,null,null,null,{"$f":"\"- \"&PROPER(IF(INDEX(RT,1,9)=\"\",INDEX(RT,1,1),INDEX(RT,1,9)))","v":"- Resp. Territorio"},null,null,null,{"$f":"\"- \"&IF(INDEX(PLO,1,9)=\"\",INDEX(PLO,1,1),INDEX(PLO,1,9))","v":"- Agenti P.L."},null,null,null,"--",null,null,null,"O1 - O2"]
[null,null,null,null,null,null,null,null,null,null,null,null,null,null,null,{"$f":"\"- \"&IF(INDEX(VF,1,9)=\"\",INDEX(VF,1,1),INDEX(VF,1,9))","v":"- VV.F."},null,null,null,null,null,null,null,"A2.2  C2.1"]
[]
[{"$f":"IF(INDEX(RT,1,9)=\"\",INDEX(RT,1,1),INDEX(RT,1,9))","v":"RESP. TERRITORIO"},null,null,null,null,"Collabora nell'organizzazione del sopralluogo e avvisa il gestore del servizio.",null,null,null,null,null,"--",null,null,null,null,null,null,null,"--",null,null,null,"A2.1  C1"]
[null,null,null,null,null,null,null,null,null,null,null,null,null,null,null,{"$f":"\"- \"&IF(INDEX(TCO,1,9)=\"\",INDEX(TCO,1,1),INDEX(TCO,1,9))","v":"- Tecnici Comunali"}]
[null,null,null,null,null,null,null,null,null,null,null,null,null,null,null,{"$f":"\"- \"&IF(INDEX(GEG,1,9)=\"\",INDEX(GEG,1,1),INDEX(GEG,1,9))","v":"- Gestore Gas"}]
[]
[{"$f":"IF(INDEX(PL,1,9)=\"\",INDEX(PL,1,1),INDEX(PL,1,9))","v":"POLIZIA LOCALE"},null,null,null,null,{"$f":"\"Organizza in accordo con i VV.F. cancelli per il traffico e informa la popolazione. \"&_RG2&\".1\"","v":"Organizza in accordo con i VV.F. cancelli per il traffico e informa la popolazione. RG.2.1"},null,null,null,null,null,{"$f":"\"- \"&PROPER(IF(INDEX(CC,1,9)=\"\",INDEX(CC,1,1),INDEX(CC,1,9)))","v":"- C. Carabinieri"},null,null,null,null,null,null,null,"--",null,null,null,null,null,null,{"$f":"_RG2&\".1\"","v":"RG.2.1"}]
[null,null,null,null,null,null,null,null,null,null,null,null,null,null,null,{"$f":"\"- \"&IF(INDEX(PLO,1,9)=\"\",INDEX(PLO,1,1),INDEX(PLO,1,9))","v":"- Agenti P.L."},null,null,null,null,null,null,null,"O1 - O2"]
[null,null,null,null,null,null,null,null,null,null,null,null,null,null,null,{"$f":"\"- \"&IF(INDEX(VF,1,9)=\"\",INDEX(VF,1,1),INDEX(VF,1,9))","v":"- VV.F."},null,null,null,null,null,null,null,"A2.2  C2.1"]
[]
[{"$f":"IF(INDEX(CC,1,9)=\"\",INDEX(CC,1,1),INDEX(CC,1,9))","v":"C. CARABINIERI"},null,null,null,null,{"$f":"\"Coadiuva \"&_RG2&\".1\"","v":"Coadiuva RG.2.1"},null,null,null,null,null,"--",null,null,null,{"$f":"\"- \"&IF(INDEX(CO,1,9)=\"\",INDEX(CO,1,1),INDEX(CO,1,9))","v":"- Carabinieri"},null,null,null,"--",null,null,null,"--"]
["SE DA SOPRALLUOGO RISULTA CHE LA FUGA DI GAS E' RILEVANTE CON PERICOLO PER LA POPOLAZIONE"]
[{"$f":"IF(INDEX(Sindaco,1,9)=\"\",INDEX(Sindaco,1,1),INDEX(Sindaco,1,9))","v":"SINDACO / R.O.C."},null,null,null,null,"Attiva  l'UCL e dichiara lo Stato di Allarme.",null,null,null,null,null,"- Tutti",null,null,null,"--",null,null,null,"--",null,null,null,"O1 - O2"]
[]
[{"$f":"IF(INDEX(RT,1,9)=\"\",INDEX(RT,1,1),INDEX(RT,1,9))","v":"RESP. TERRITORIO"},null,null,null,null,"Su richiesta dei VV.F. sospende l'erogazionedei servizi essenziali.",null,null,null,null,null,"--",null,null,null,{"$f":"\"- \"&IF(INDEX(TCO,1,9)=\"\",INDEX(TCO,1,1),INDEX(TCO,1,9))","v":"- Tecnici Comunali"},null,null,null,"--",null,null,null,"A2.1  C1"]
[null,null,null,null,null,null,null,null,null,null,null,null,null,null,null,{"$f":"\"- \"&IF(INDEX(GEE,1,9)=\"\",INDEX(GEE,1,1),INDEX(GEE,1,9))","v":"- Gestore Elettricità"}]
[null,null,null,null,null,null,null,null,null,null,null,null,null,null,null,{"$f":"\"- \"&IF(INDEX(GEA,1,9)=\"\",INDEX(GEA,1,1),INDEX(GEA,1,9))","v":"- Gestore Acquedotto"}]
[{"$f":"IF(INDEX(Sindaco,1,9)=\"\",INDEX(Sindaco,1,1),INDEX(Sindaco,1,9))","v":"SINDACO / R.O.C."},null,null,null,null,{"$f":"\"In accordo coi VV.F. attiva le aree di emergenza (\"&_RG2&\".2),\"&\" dispone le evacuazioni (\"&_RG2&\".3) e avvisa gli enti sovraordinati e i media.\"","v":"In accordo coi VV.F. attiva le aree di emergenza (RG.2.2), dispone le evacuazioni (RG.2.3) e avvisa gli enti sovraordinati e i media."},null,null,null,null,null,null,null,null,null,"--"]
[null,null,null,null,null,null,null,null,null,null,null,null,null,null,null,null,null,null,null,{"$f":"\"- \"&IF(INDEX(PR,1,9)=\"\",INDEX(PR,1,1),INDEX(PR,1,9))","v":"- Prefettura"}]
[null,null,null,null,null,null,null,null,null,null,null,{"$f":"\"- \"&PROPER(IF(INDEX(PL,1,9)=\"\",INDEX(PL,1,1),INDEX(PL,1,9)))","v":"- Polizia Locale"},null,null,null,null,null,null,null,{"$f":"\"- \"&IF(INDEX(PRO,1,9)=\"\",INDEX(PRO,1,1),INDEX(PRO,1,9))","v":"- Provincia"},null,null,null,"O1 - O2"]
[null,null,null,null,null,null,null,null,null,null,null,{"$f":"\"- \"&PROPER(IF(INDEX(RT,1,9)=\"\",INDEX(RT,1,1),INDEX(RT,1,9)))","v":"- Resp. Territorio"},null,null,null,null,null,null,null,{"$f":"\"- \"&IF(INDEX(REG,1,9)=\"\",INDEX(REG,1,1),INDEX(REG,1,9))","v":"- Regione"},null,null,null,"C2.1","C2.3","C2.4",{"$f":"_RG2&\".2\"","v":"RG.2.2"}]
[]
[]
[{"$f":"IF(INDEX(RT,1,9)=\"\",INDEX(RT,1,1),INDEX(RT,1,9))","v":"RESP. TERRITORIO"},null,null,null,null,{"$f":"\"Responsabile \"&_RG2&\".2\"","v":"Responsabile RG.2.2"},null,null,null,null,null,null,null,null,null,{"$f":"\"- \"&IF(INDEX(TCO,1,9)=\"\",INDEX(TCO,1,1),INDEX(TCO,1,9))","v":"- Tecnici Comunali"},null,null,null,"--",null,null,null,"O1 - O2",null,"A2.1"]
[null,null,null,null,null,null,null,null,null,null,null,{"$f":"\"- \"&PROPER(IF(INDEX(CV,1,9)=\"\",INDEX(CV,1,1),INDEX(CV,1,9)))","v":"- C. Volontariato"},null,null,null,null,null,null,null,null,null,null,null,"A4","A5","A6"]
[null,null,null,null,null,null,null,null,null,null,null,{"$f":"\"- \"&PROPER(IF(INDEX(RSS,1,9)=\"\",INDEX(RSS,1,1),INDEX(RSS,1,9)))","v":"- Resp. Serv. Sociali"},null,null,null,null,null,null,null,null,null,null,null,"A7.1","A7.2","B5"]
[null,null,null,null,null,null,null,null,null,null,null,null,null,null,null,null,null,null,null,null,null,null,null,"B6","C1"]
[{"$f":"IF(INDEX(CV,1,9)=\"\",INDEX(CV,1,1),INDEX(CV,1,9))","v":"C. VOLONTARIATO"},null,null,null,null,{"$f":"\"Coadiuva \"&_RG2&\".2\"","v":"Coadiuva RG.2.2"},null,null,null,null,null,"--",null,null,null,{"$f":"\"- \"&IF(INDEX(VO,1,9)=\"\",INDEX(VO,1,1),INDEX(VO,1,9))","v":"- Gruppi Volontari"},null,null,null,"--",null,null,null,"A3 - B3"]
[{"$f":"IF(INDEX(RSS,1,9)=\"\",INDEX(RSS,1,1),INDEX(RSS,1,9))","v":"RESP. SERV. SOCIALI"},null,null,null,null,{"$f":"\"Coadiuva \"&_RG2&\".2\"","v":"Coadiuva RG.2.2"},null,null,null,null,null,"--",null,null,null,{"$f":"\"- \"&IF(INDEX(SO,1,9)=\"\",INDEX(SO,1,1),INDEX(SO,1,9))","v":"- Pers. Sanitario"},null,null,null,"--",null,null,null,"B1 - C2.2  - D1"]
[{"$f":"IF(INDEX(PL,1,9)=\"\",INDEX(PL,1,1),INDEX(PL,1,9))","v":"POLIZIA LOCALE"},null,null,null,null,{"$f":"\"Responsabile \"&_RG2&\".3\"","v":"Responsabile RG.2.3"},null,null,null,null,null,{"$f":"\"- \"&PROPER(IF(INDEX(CV,1,9)=\"\",INDEX(CV,1,1),INDEX(CV,1,9)))","v":"- C. Volontariato"},null,null,null,{"$f":"\"- \"&IF(INDEX(PLO,1,9)=\"\",INDEX(PLO,1,1),INDEX(PLO,1,9))","v":"- Agenti P.L."},null,null,null,"--",null,null,null,"O1 - O2  A2.2",null,null,{"$f":"_RG2&\".3\"","v":"RG.2.3"}]
[null,null,null,null,null,null,null,null,null,null,null,{"$f":"\"- \"&PROPER(IF(INDEX(CC,1,9)=\"\",INDEX(CC,1,1),INDEX(CC,1,9)))","v":"- C. Carabinieri"},null,null,null,null,null,null,null,null,null,null,null,"M2","D2"]
[{"$f":"IF(INDEX(CV,1,9)=\"\",INDEX(CV,1,1),INDEX(CV,1,9))","v":"C. VOLONTARIATO"},null,null,null,null,{"$f":"\"Coadiuva \"&_RG2&\".3\"","v":"Coadiuva RG.2.3"},null,null,null,null,null,"--",null,null,null,{"$f":"\"- \"&IF(INDEX(VO,1,9)=\"\",INDEX(VO,1,1),INDEX(VO,1,9))","v":"- Gruppi Volontari"},null,null,null,"--",null,null,null,"A3 - B3"]
[{"$f":"IF(INDEX(CC,1,9)=\"\",INDEX(CC,1,1),INDEX(CC,1,9))","v":"C. CARABINIERI"},null,null,null,null,{"$f":"\"Coadiuva \"&_RG2&\".3\"","v":"Coadiuva RG.2.3"},null,null,null,null,null,"--",null,null,null,{"$f":"\"- \"&IF(INDEX(CO,1,9)=\"\",INDEX(CO,1,1),INDEX(CO,1,9))","v":"- Carabinieri"},null,null,null,"--",null,null,null,"--"]
[{"$f":"IF(INDEX(Sindaco,1,9)=\"\",INDEX(Sindaco,1,1),INDEX(Sindaco,1,9))","v":"SINDACO / R.O.C."},null,null,null,null,"Informa periodicamente gli enti sovraordinati e i media su quanto fatto.",null,null,null,null,null,"--",null,null,null,"--",null,null,null,{"$f":"\"- \"&IF(INDEX(PR,1,9)=\"\",INDEX(PR,1,1),INDEX(PR,1,9))","v":"- Prefettura"}]
[null,null,null,null,null,null,null,null,null,null,null,null,null,null,null,null,null,null,null,{"$f":"\"- \"&IF(INDEX(PRO,1,9)=\"\",INDEX(PRO,1,1),INDEX(PRO,1,9))","v":"- Provincia"},null,null,null,"C2.1","C2.3","C2.4"]
[null,null,null,null,null,null,null,null,null,null,null,null,null,null,null,null,null,null,null,{"$f":"\"- \"&IF(INDEX(REG,1,9)=\"\",INDEX(REG,1,1),INDEX(REG,1,9))","v":"- Regione"}]
["AD INTERVENTI DI MITIGAZIONE E MESSA IN SICUREZZA AVVENUTI"]
[{"$f":"IF(INDEX(Sindaco,1,9)=\"\",INDEX(Sindaco,1,1),INDEX(Sindaco,1,9))","v":"SINDACO / R.O.C."},null,null,null,null,"Informa sulla revoca dello Stato di Allarme  e ordina il rientro degli sfollati. ",null,null,null,null,null,"- Tutti",null,null,null,{"$f":"\"- \"&IF(INDEX(SC,1,9)=\"\",INDEX(SC,1,1),INDEX(SC,1,9))","v":"- Squadre Operativi"},null,null,null,{"$f":"\"- \"&IF(INDEX(PR,1,9)=\"\",INDEX(PR,1,1),INDEX(PR,1,9))","v":"- Prefettura"},null,null,null,"O1 - O2"]
[null,null,null,null,null,null,null,null,null,null,null,null,null,null,null,null,null,null,null,{"$f":"\"- \"&IF(INDEX(PRO,1,9)=\"\",INDEX(PRO,1,1),INDEX(PRO,1,9))","v":"- Provincia"},null,null,null,"C2.1","C2.3","C2.4"]
["MEMBRI U.C.L",null,null,null,null,null,null,null,null,null,null,null,null,null,null,null,null,null,null,{"$f":"\"- \"&IF(INDEX(REG,1,9)=\"\",INDEX(REG,1,1),INDEX(REG,1,9))","v":"- Regione"},null,null,null,"M1","M2"]
[]
["PER LE COMUNICAZIONI EVIDENZIATE IN ROSSO UTILIZZARE IL MODULO FAX M4"]
[]
[]
[]
[]
[]
[]
[]
[]
[]
[{"$f":"Titolo3","v":"Scheda Procedura Operativa"},null,null,null,null,null,null,null,null,null,null,null,null,null,null,null,null,null,null,null,null,null,null,{"$f":"X4","v":"RG.2"}]
[]
[{"$f":"$A$6","v":"Rischio di Incidente Rete Metano - Fase di Allarme"}]
[]
[]
[null,"Codice Scheda Scenario",null,null,null,null,null,{"$f":"X4","v":"RG.2"}]
[null,"Tipo di Procedure",null,null,null,null,null,{"$f":"_RG2&\".1 \"&_RG2&\".2 \"&_RG2&\".3 - AZIONI DI SALVAGUARDIA\"","v":"RG.2.1 RG.2.2 RG.2.3 - AZIONI DI SALVAGUARDIA"}]
[null,"Ubicazione intervento",null,null,null,null,null," --"]
[null,"Aree di raccolta popolazione",null,null,null,null,null,{"$f":"IF(INDEX(RG2RIC,1,1)=\"\",\"In questa fase non è prevista l’attivazione di tali aree.\",\"Per questa emergenza \"&IF(INDEX(RG2RIC,1,2)=\"\",\"è disponibile la seguente area:\",\"sono disponibili le seguenti aree:\"))","v":"Per questa emergenza sono disponibili le seguenti aree:"}]
[null,null,null,null,null,null,null,{"$f":"IF(INDEX(RG2RIC,1,1)=\"\",\"\",\"- \"&VLOOKUP(INDEX(RG2RIC,1,1),Ricovero,2))","v":"- Centro Sportivo Comunale - Carta AE.41 - Trescore Cremasco - Ricovero/Tendopoli"}]
[null,null,null,null,null,null,null,{"$f":"IF(INDEX(RG2RIC,1,2)=\"\",\"\",\"- \"&VLOOKUP(INDEX(RG2RIC,1,2),Ricovero,2))","v":"- Scuola Secondaria di I Grado \"Manzoni\" - Carta AE.42 - Trescore Cremasco - Ricovero"}]
[null,null,null,null,null,null,null,{"$f":"IF(INDEX(RG2RIC,1,3)=\"\",\"\",\"- \"&VLOOKUP(INDEX(RG2RIC,1,3),Ricovero,2))","v":"- Scuola Primaria Trescore Cremasco - Carta AE.43 - Trescore Cremasco - Ricovero"}]
[null,"Area di ricovero",null,null,null,null,null,{"$f":"IF(INDEX(RG2RIC,1,4)=\"\",\"\",\"- \"&VLOOKUP(INDEX(RG2RIC,1,4),Ricovero,2))","v":""}]
[null,null,null,null,null,null,null,{"$f":"IF(INDEX(RG2RIC,1,5)=\"\",\"\",\"- \"&VLOOKUP(INDEX(RG2RIC,1,5),Ricovero,2))","v":""}]
[null,null,null,null,null,null,null,{"$f":"IF(INDEX(RG2RIC,1,6)=\"\",\"\",\"- \"&VLOOKUP(INDEX(RG2RIC,1,6),Ricovero,2))","v":""}]
[null,null,null,null,null,null,null,{"$f":"IF(INDEX(RG2RIC,1,7)=\"\",\"\",\"- \"&VLOOKUP(INDEX(RG2RIC,1,7),Ricovero,2))","v":""}]
[null,null,null,null,null,null,null,{"$f":"IF(H196=\"\",\"\",\"In funzione della gravità della situazione si decide quali/quante aree attivare.\")","v":""}]
[null,"Area di raduno soccorritori",null,null,null,null,null,"Viene scelta e sgomberata in funzione della localizzazione dell'incidente."]
[]
[]
[]
[]
[null,"Cancelli e vie alternative",null,null,null,null,null," --"]
[]
[null,"Contatti Utili",null,null,null,null,null,"Si faccia riferimento al PRONTUARIO DI EMERGENZA - CONTATTI"]
[]
[]
[]
[]
[null,null,"Procedura Operativa Standard (POS)",null,null,null,null,null,null,null,null,null,null,null,null,"Procedure Previste"]
[null,null,null,null,null,null,null,null,null,null,null,null,null,null,null,{"$f":"MID(H190,1,6)","v":"RG.2.1"},null,null,{"$f":"MID(H190,8,6)","v":"RG.2.2"},null,null,{"$f":"MID(H190,15,6)","v":"RG.2.3"}]
[null,null,1,"Monitoraggio",null,null,null,null,null,null,null,null,null,null,null,"--",null,null,"--",null,null,"--"]
[null,null,2,"Perlustrazione",null,null,null,null,null,null,null,null,null,null,null,"--",null,null,"--",null,null,"--"]
[null,null,3,"Presidio Cancelli/Supporto Viabilità",null,null,null,null,null,null,null,null,null,null,null,"X",null,null,"--",null,null,"--"]
[null,null,4,"Informazione Diretta alla Popolazione",null,null,null,null,null,null,null,null,null,null,null,"X",null,null,"--",null,null,"--"]
[null,null,5,"Allestimento Area di Ricovero",null,null,null,null,null,null,null,null,null,null,null,"--",null,null,"X",null,null,"--"]
[null,null,6,"Allestimento Area di Ammassamento Soccorsi",null,null,null,null,null,null,null,null,null,null,null,"--",null,null,"--",null,null,"--"]
[null,null,7,"Evacuazione",null,null,null,null,null,null,null,null,null,null,null,"--",null,null,"--",null,null,"X"]
[null,null,8,"Rimozione Ostacoli",null,null,null,null,null,null,null,null,null,null,null,"--",null,null,"--",null,null,"--"]
[null,null,9,"Rimozione Ostacoli da Alveo",null,null,null,null,null,null,null,null,null,null,null,"--",null,null,"--",null,null,"--"]
[null,null,10,"Preservazione Argini",null,null,null,null,null,null,null,null,null,null,null,"--",null,null,"--",null,null,"--"]
[null,null,11,"Frana",null,null,null,null,null,null,null,null,null,null,null,"--",null,null,"--",null,null,"--"]

{"sheet":"RG_3","index":10,"n_rows":225,"n_cols":33,"rows_kept":225,"cut":false,"hidden":false,"merged":[[191,7,191,24],[192,7,192,24],[193,7,193,24],[194,7,194,24],[195,1,199,6],[195,7,195,24],[196,7,196,24],[197,7,197,24],[198,7,198,24],[199,7,199,24],[44,5,44,24],[45,5,47,24],[188,1,188,6],[188,7,188,24],[189,1,189,6],[189,7,189,24],[60,10,60,24],[54,1,58,9],[54,10,58,24],[59,1,59,9],[59,10,59,24],[60,1,61,9],[61,10,61,24],[131,23,131,25],[134,23,134,25],[123,0,124,22],[123,23,126,25],[125,0,126,22],[132,19,132,22],[133,19,133,22],[128,0,130,4],[128,5,130,10],[128,11,128,25],[129,11,130,14],[0,0,1,6],[0,7,1,18],[0,19,1,25],[3,0,4,22],[3,23,6,25],[5,0,6,22],[8,1,8,9],[8,10,8,24],[9,1,9,9],[9,10,9,24],[10,1,14,9],[10,10,14,24],[15,1,18,9],[24,1,27,9],[24,10,27,24],[15,10,18,24],[19,1,20,9],[19,10,20,24],[21,1,23,9],[21,17,23,24],[21,10,21,16],[22,10,22,16],[23,10,23,16],[28,1,31,9],[32,1,35,9],[32,10,35,24],[28,10,30,24],[31,10,31,24],[40,1,44,4],[45,1,47,4],[40,5,40,24],[51,1,53,9],[51,11,51,24],[52,11,52,24],[53,11,53,24],[36,1,39,4],[36,5,36,24],[37,5,37,24],[38,5,38,24],[39,5,39,24],[48,1,50,9],[48,10,48,24],[49,10,49,24],[50,10,50,24],[41,5,41,24],[42,5,42,24],[43,5,43,24],[129,15,130,18],[129,19,130,22],[129,23,130,25],[134,19,136,22],[135,15,135,18],[136,15,136,18],[131,0,133,4],[131,5,133,10],[131,11,133,14],[131,15,133,18],[131,19,131,22],[134,0,136,4],[134,5,136,10],[134,11,136,14],[134,15,134,18],[149,26,150,26],[151,26,158,26],[141,15,144,18],[141,19,144,22],[153,0,156,4],[153,5,156,10],[137,0,140,4],[137,5,140,10],[137,11,140,14],[137,15,137,18],[145,19,145,22],[145,23,145,25],[141,0,144,4],[141,5,144,10],[141,11,144,14],[139,15,139,18],[140,15,140,18],[141,23,144,25],[137,19,140,22],[137,23,140,25],[138,15,138,18],[141,26,145,26],[145,0,145,4],[145,5,145,10],[162,11,162,14],[162,15,162,18],[162,19,162,22],[162,23,162,25],[159,23,159,25],[145,11,145,14],[145,15,145,18],[146,0,148,4],[146,5,148,10],[146,11,148,14],[146,15,146,18],[146,19,148,22],[146,23,148,25],[147,15,147,18],[148,15,148,18],[149,0,152,4],[149,5,152,10],[149,15,152,18],[158,0,158,4],[158,5,158,10],[158,11,158,14],[158,15,158,18],[158,19,158,22],[158,23,158,25],[157,0,157,4],[157,5,157,10],[157,11,157,14],[157,15,157,18],[157,19,157,22],[157,23,157,25],[149,19,149,22],[150,19,150,22],[151,19,151,22],[152,19,152,22],[150,23,150,25],[153,23,153,24],[153,15,156,18],[153,19,156,22],[154,11,154,14],[155,11,155,14],[171,19,171,22],[172,19,172,22],[163,0,165,4],[163,5,165,10],[163,11,165,14],[163,15,165,18],[163,19,165,22],[159,26,162,26],[160,11,160,14],[161,0,161,4],[161,5,161,10],[161,11,161,14],[161,15,161,18],[161,19,161,22],[161,23,161,25],[162,0,162,4],[162,5,162,10],[159,0,160,4],[159,5,160,10],[159,11,159,14],[159,15,160,18],[159,19,160,22],[166,11,168,14],[166,15,168,18],[183,0,184,22],[183,23,186,25],[185,0,186,22],[190,1,190,6],[190,7,190,24],[214,3,214,14],[215,3,215,14],[216,3,216,14],[214,15,214,17],[214,18,214,20],[214,21,214,23],[215,15,215,17],[215,18,215,20],[215,21,215,23],[216,15,216,17],[216,18,216,20],[216,21,216,23],[212,2,213,14],[212,15,212,23],[213,15,213,17],[213,18,213,20],[213,21,213,23],[200,1,204,6],[191,1,194,6],[205,7,206,24],[207,1,208,6],[207,7,208,24],[221,18,221,20],[220,18,220,20],[217,15,217,17],[217,18,217,20],[217,21,217,23],[220,21,220,23],[217,3,217,14],[218,3,218,14],[219,3,219,14],[220,3,220,14],[221,3,221,14],[166,19,168,22],[222,3,222,14],[223,3,223,14],[224,3,224,14],[218,21,218,23],[219,15,219,17],[219,18,219,20],[219,21,219,23],[221,21,221,23],[223,21,223,23],[220,15,220,17],[224,15,224,17],[224,18,224,20],[221,15,221,17],[218,15,218,17],[218,18,218,20],[224,21,224,23],[223,15,223,17],[223,18,223,20],[222,15,222,17],[222,18,222,20],[222,21,222,23],[200,7,204,24],[205,1,206,6],[63,0,64,22],[63,23,66,25],[65,0,66,22],[177,0,177,25],[166,23,166,25],[167,23,167,25],[173,23,173,25],[163,23,165,25],[173,0,174,4],[173,5,175,10],[173,11,175,14],[173,15,175,18],[173,19,173,22],[174,19,174,22],[175,0,175,4],[175,19,175,22],[169,0,169,25],[170,0,172,4],[170,5,172,10],[170,11,172,14],[170,15,172,18],[170,19,170,22],[166,0,168,4],[166,5,168,10]]}
[{"$f":"NCOM&\" (\"&PCOM&\")\"","v":"Comune di Trescore Cremasco (CR)"},null,null,null,null,null,null,{"$f":"IF(INDEX(INT,1,13)=\"\",INDEX(INT,1,1),INDEX(INT,1,13))","v":"Piano di Emergenza Intercomunale di Protezione Civile"},null,null,null,null,null,null,null,null,null,null,null,{"$f":"IF(TIPOP=\"Edizione\",\"Ed. \",IF(TIPOP=\"Revisione\",\"Rev. \",\"Bozza \"))&TIPON&\" del \"&TIPOD","v":"Ed. 01 del 04/11/2012"}]
[]
[]
["Scheda Scenario",null,null,null,null,null,null,null,null,null,null,null,null,null,null,null,null,null,null,null,null,null,null,{"$f":"_RG3","v":"RG.3"}]
[]
[{"$f":"IF(INDEX(RG3PAR,1,19)=\"\",INDEX(RG3PAR,1,12),INDEX(RG3PAR,1,19))&\" - Fase di Emergenza\"","v":"Rischio di Incidente Rete Metano - Fase di Emergenza"}]
[]
[]
[null,"Paragrafi di Riferimento ",null,null,null,null,null,null,null,null,{"$f":"INDEX(RG3PAR,1,1)&INDEX(RG3PAR,1,12)","v":"2.2.8.1 - 3.3.6 Procedure per il Rischio di Incidente Rete Metano"}]
[null,"Codice Scheda",null,null,null,null,null,null,null,null,{"$f":"X4","v":"RG.3"}]
[null,"Evento atteso",null,null,null,null,null,null,null,null,"Esplosione dovuta a perdita di gas in abitazioni o lungo la rete di distribuzione.  "]
[]
[]
[]
[]
[null,"Attività U.C.L.",null,null,null,null,null,null,null,null,"Supporta e collabora con il ROS dei VV.F. il quale gestisce in prima persona le operazioni di soccorso nell'ambito dell'area interessata dalla esplosione."]
[]
[]
[]
[null,"Ubicazione intervento",null,null,null,null,null,null,null,null,"Aree limitrofe all'incidente."]
[]
[null,"Personale mobilitato",null,null,null,null,null,null,null,null,{"$f":"IF(INDEX(RG3PER,1,1)=\"\",\"\",\"- \"&VLOOKUP(INDEX(RG3PER,1,1),Personale,IF(INDEX(Personale,INDEX(RG3PER,1,1),14)=\"\",2,14)))","v":"- Polizia Locale"},null,null,null,null,null,null,"Riportare la composizione delle squadre nel Modulo M1"]
[null,null,null,null,null,null,null,null,null,null,{"$f":"IF(INDEX(RG3PER,1,2)=\"\",\"\",\"- \"&VLOOKUP(INDEX(RG3PER,1,2),Personale,IF(INDEX(Personale,INDEX(RG3PER,1,2),14)=\"\",2,14)))","v":"- Volontari P.C."}]
[null,null,null,null,null,null,null,null,null,null,{"$f":"IF(INDEX(RG3PER,1,3)=\"\",\"\",\"- \"&VLOOKUP(INDEX(RG3PER,1,3),Personale,IF(INDEX(Personale,INDEX(RG3PER,1,3),14)=\"\",2,14)))","v":"- Tecnici/Operai Comunali"}]
[null,"Attività personale mobilitato",null,null,null,null,null,null,null,null,"Collaborazione con i VV.F. per il soccorso alla popolazione, in accordo al piano di emergenza comunale."]
[]
[]
[]
[null,"Grado di coinvolgimento della popolazione",null,null,null,null,null,null,null,null,"Dipende dall'ampiezza della zona colpita. Si procede con il soccorrere le persone coivolte,  si informa la popolazione interessata e si evacuano le persone che si trovano nelle zone a maggior rischio."]
[]
[]
[null,null,null,null,null,null,null,null,null,null,"Registrare le persone eventualmente evacuate nel Modulo M2"]
[null,"Cancelli e vie alternative",null,null,null,null,null,null,null,null,"In accordo con il ROS vengono posizionati dei cancelli finalizzati alla regolazione del traffico nelle zone interessate."]
[]
[]
[]
[null,"Aree di raccolta popolazione",null,null,null,{"$f":"IF(INDEX(RG3RIC,1,1)=\"\",\"In questa fase non è prevista l’attivazione di tali aree.\",\"Per questa emergenza \"&IF(INDEX(RG3RIC,1,2)=\"\",\"è disponibile la seguente area:\",\"sono disponibili le seguenti aree:\"))","v":"Per questa emergenza sono disponibili le seguenti aree:"}]
[null,null,null,null,null,{"$f":"IF(INDEX(RG3RIC,1,1)=\"\",\"\",\"- \"&VLOOKUP(INDEX(RG3RIC,1,1),Ricovero,2))","v":"- Centro Sportivo Comunale - Carta AE.41 - Trescore Cremasco - Ricovero/Tendopoli"}]
[null,null,null,null,null,{"$f":"IF(INDEX(RG3RIC,1,2)=\"\",\"\",\"- \"&VLOOKUP(INDEX(RG3RIC,1,2),Ricovero,2))","v":"- Scuola Secondaria di I Grado \"Manzoni\" - Carta AE.42 - Trescore Cremasco - Ricovero"}]
[null,null,null,null,null,{"$f":"IF(INDEX(RG3RIC,1,3)=\"\",\"\",\"- \"&VLOOKUP(INDEX(RG3RIC,1,3),Ricovero,2))","v":"- Scuola Primaria Trescore Cremasco - Carta AE.43 - Trescore Cremasco - Ricovero"}]
[null,"Area di ricovero",null,null,null,{"$f":"IF(INDEX(RG3RIC,1,4)=\"\",\"\",\"- \"&VLOOKUP(INDEX(RG3RIC,1,4),Ricovero,2))","v":""}]
[null,null,null,null,null,{"$f":"IF(INDEX(RG3RIC,1,5)=\"\",\"\",\"- \"&VLOOKUP(INDEX(RG3RIC,1,5),Ricovero,2))","v":""}]
[null,null,null,null,null,{"$f":"IF(INDEX(RG3RIC,1,6)=\"\",\"\",\"- \"&VLOOKUP(INDEX(RG3RIC,1,6),Ricovero,2))","v":""}]
[null,null,null,null,null,{"$f":"IF(INDEX(RG3RIC,1,7)=\"\",\"\",\"- \"&VLOOKUP(INDEX(RG3RIC,1,7),Ricovero,2))","v":""}]
[null,null,null,null,null,{"$f":"IF(F39=\"\",\"\",\"In funzione della gravità della situazione si decide quali/quante aree attivare.\")","v":"In funzione della gravità della situazione si decide quali/quante aree attivare."}]
[null,"Area di raduno soccorritori",null,null,null,"Viene scelta e sgomberata in funzione della localizzazione dell'incidente."]
[]
[]
[null,"Ordinanze Necessarie",null,null,null,null,null,null,null,null,"Ordinanza di Evacuazione;"]
[null,null,null,null,null,null,null,null,null,null,"Ordinanza di Chiusura Strade."]
[]
[null,"Modalita’ Riunione U.C.L.",null,null,null,null,null,null,null,null,null,"Non necessaria"]
[null,null,null,null,null,null,null,null,null,null,"X","Virtuale"]
[null,null,null,null,null,null,null,null,null,null,"X","In sede"]
[null,"Possibili Scenari Concomitanti",null,null,null,null,null,null,null,null,"Non ragionevolmente prevedibile la concomitanza con altri eventi."]
[]
[]
[]
[]
[null,"Contatti Utili",null,null,null,null,null,null,null,null,{"$f":"\"Consultare il \"&IF([1]Maschera!Z71=\"\",[1]Maschera!N71,[1]Maschera!Z71)","v":"Consultare il Tomo Giallo - Risorse"}]
[null,"Cartografia",null,null,null,null,null,null,null,null,{"$f":"INDEX(RG3PAR,1,28)","v":"Tav. 3/B - Rischio Industriale"}]
[null,null,null,null,null,null,null,null,null,null,{"$f":"INDEX(RG3PAR,1,39)","v":"Tav. 3/D - Stradario Piano di Emergenza"}]
[]
[{"$f":"Titolo2","v":"Procedure U.C.L."},null,null,null,null,null,null,null,null,null,null,null,null,null,null,null,null,null,null,null,null,null,null,{"$f":"_RG3","v":"RG.3"}]
[]
[{"$f":"$A$6","v":"Rischio di Incidente Rete Metano - Fase di Emergenza"}]
[]
[]
[]
[]
[]
[]
[]
[]
[]
[]
[]
[]
[]
[]
[]
[]
[]
[]
[]
[]
[]
[]
[]
[]
[]
[]
[]
[]
[]
[]
[]
[]
[]
[]
[]
[]
[]
[]
[]
[]
[]
[]
[]
[]
[]
[]
[]
[]
[]
[]
[]
[]
[]
[]
[]
[]
[]
[{"$f":"Titolo2","v":"Procedure U.C.L."},null,null,null,null,null,null,null,null,null,null,null,null,null,null,null,null,null,null,null,null,null,null,{"$f":"X4","v":"RG.3"}]
[]
[{"$f":"$A$6","v":"Rischio di Incidente Rete Metano - Fase di Emergenza"}]
[]
[]
["RESPONSABILE",null,null,null,null,"AZIONE",null,null,null,null,null,"CHIAMATE"]
[null,null,null,null,null,null,null,null,null,null,null,"MEMBRO UCL",null,null,null,"OPERATIVI",null,null,null,"ENTE INTERESSATO",null,null,null,"SCHEDE RISORSE"]
[]
[{"$f":"IF(INDEX(Sindaco,1,9)=\"\",INDEX(Sindaco,1,1),INDEX(Sindaco,1,9))","v":"SINDACO / R.O.C."},null,null,null,null,"Attiva  l'UCL e attiva la Fase di Emergenza.",null,null,null,null,null,"- Tutti",null,null,null,"--",null,null,null,{"$f":"\"- \"&IF(INDEX(PR,1,9)=\"\",INDEX(PR,1,1),INDEX(PR,1,9))","v":"- Prefettura"},null,null,null,"O1 - O2"]
[null,null,null,null,null,null,null,null,null,null,null,null,null,null,null,null,null,null,null,{"$f":"\"- \"&IF(INDEX(PRO,1,9)=\"\",INDEX(PRO,1,1),INDEX(PRO,1,9))","v":"- Provincia"},null,null,null,"C2.1","C2.3","C2.4"]
[null,null,null,null,null,null,null,null,null,null,null,null,null,null,null,null,null,null,null,{"$f":"\"- \"&IF(INDEX(REG,1,9)=\"\",INDEX(REG,1,1),INDEX(REG,1,9))","v":"- Regione"}]
[{"$f":"IF(INDEX(PL,1,9)=\"\",INDEX(PL,1,1),INDEX(PL,1,9))","v":"POLIZIA LOCALE"},null,null,null,null,"Effettua sopralluogo nell'area interessata e avverte i VV.F.",null,null,null,null,null,{"$f":"\"- \"&PROPER(IF(INDEX(RT,1,9)=\"\",INDEX(RT,1,1),INDEX(RT,1,9)))","v":"- Resp. Territorio"},null,null,null,{"$f":"\"- \"&IF(INDEX(PLO,1,9)=\"\",INDEX(PLO,1,1),INDEX(PLO,1,9))","v":"- Agenti P.L."},null,null,null,"--",null,null,null,"O1 - O2"]
[null,null,null,null,null,null,null,null,null,null,null,null,null,null,null,{"$f":"\"- \"&IF(INDEX(CRI,1,9)=\"\",INDEX(CRI,1,1),INDEX(CRI,1,9))","v":"- 118"},null,null,null,null,null,null,null,"A2.2","C2.1","C2.2"]
[null,null,null,null,null,null,null,null,null,null,null,null,null,null,null,{"$f":"\"- \"&IF(INDEX(VF,1,9)=\"\",INDEX(VF,1,1),INDEX(VF,1,9))","v":"- VV.F."}]
[{"$f":"IF(INDEX(RT,1,9)=\"\",INDEX(RT,1,1),INDEX(RT,1,9))","v":"RESP. TERRITORIO"},null,null,null,null,"Collabora nell'organizzazione del sopralluogo e avvisa il gestore del servizio.",null,null,null,null,null,"--",null,null,null,null,null,null,null,"--",null,null,null,"A2.1  C1"]
[null,null,null,null,null,null,null,null,null,null,null,null,null,null,null,{"$f":"\"- \"&IF(INDEX(TCO,1,9)=\"\",INDEX(TCO,1,1),INDEX(TCO,1,9))","v":"- Tecnici Comunali"}]
[null,null,null,null,null,null,null,null,null,null,null,null,null,null,null,{"$f":"\"- \"&IF(INDEX(GEG,1,9)=\"\",INDEX(GEG,1,1),INDEX(GEG,1,9))","v":"- Gestore Gas"}]
[]
[{"$f":"IF(INDEX(PL,1,9)=\"\",INDEX(PL,1,1),INDEX(PL,1,9))","v":"POLIZIA LOCALE"},null,null,null,null,{"$f":"\"In accordo coi VV.F. organizza cancelli per il traffico e informa la popolazione. \"&_RG3&\".1\"","v":"In accordo coi VV.F. organizza cancelli per il traffico e informa la popolazione. RG.3.1"},null,null,null,null,null,{"$f":"\"- \"&PROPER(IF(INDEX(CC,1,9)=\"\",INDEX(CC,1,1),INDEX(CC,1,9)))","v":"- C. Carabinieri"},null,null,null,{"$f":"\"- \"&IF(INDEX(PLO,1,9)=\"\",INDEX(PLO,1,1),INDEX(PLO,1,9))","v":"- Agenti P.L."},null,null,null,"--",null,null,null,"O1 - O2  A2.2",null,null,{"$f":"_RG3&\".1\"","v":"RG.3.1"}]
[]
[]
[]
[{"$f":"IF(INDEX(CC,1,9)=\"\",INDEX(CC,1,1),INDEX(CC,1,9))","v":"C. CARABINIERI"},null,null,null,null,{"$f":"\"Coadiuva \"&_RG3&\".1\"","v":"Coadiuva RG.3.1"},null,null,null,null,null,"--",null,null,null,{"$f":"\"- \"&IF(INDEX(CO,1,9)=\"\",INDEX(CO,1,1),INDEX(CO,1,9))","v":"- Carabinieri"},null,null,null,"--",null,null,null,"--"]
[{"$f":"IF(INDEX(RT,1,9)=\"\",INDEX(RT,1,1),INDEX(RT,1,9))","v":"RESP. TERRITORIO"},null,null,null,null,"Su richiesta dei VV.F. sospende l'erogazione dei servizi essenziali.",null,null,null,null,null,"--",null,null,null,{"$f":"\"- \"&IF(INDEX(TCO,1,9)=\"\",INDEX(TCO,1,1),INDEX(TCO,1,9))","v":"- Tecnici Comunali"},null,null,null,"--",null,null,null,"A2.1  C1"]
[null,null,null,null,null,null,null,null,null,null,null,null,null,null,null,{"$f":"\"- \"&IF(INDEX(GEE,1,9)=\"\",INDEX(GEE,1,1),INDEX(GEE,1,9))","v":"- Gestore Elettricità"}]
[null,null,null,null,null,null,null,null,null,null,null,null,null,null,null,{"$f":"\"- \"&IF(INDEX(GEA,1,9)=\"\",INDEX(GEA,1,1),INDEX(GEA,1,9))","v":"- Gestore Acquedotto"}]
[{"$f":"IF(INDEX(Sindaco,1,9)=\"\",INDEX(Sindaco,1,1),INDEX(Sindaco,1,9))","v":"SINDACO / R.O.C."},null,null,null,null,{"$f":"\"In accordo coi VV.F. attiva le aree di emergenza (\"&_RG3&\".2),\"&\" e dispone le evacuazioni (\"&_RG3&\".3) .\"","v":"In accordo coi VV.F. attiva le aree di emergenza (RG.3.2), e dispone le evacuazioni (RG.3.3) ."},null,null,null,null,null,null,null,null,null,"--",null,null,null,{"$f":"\"- \"&IF(INDEX(PR,1,9)=\"\",INDEX(PR,1,1),INDEX(PR,1,9))","v":"- Prefettura"}]
[null,null,null,null,null,null,null,null,null,null,null,{"$f":"\"- \"&PROPER(IF(INDEX(PL,1,9)=\"\",INDEX(PL,1,1),INDEX(PL,1,9)))","v":"- Polizia Locale"},null,null,null,null,null,null,null,{"$f":"\"- \"&IF(INDEX(PRO,1,9)=\"\",INDEX(PRO,1,1),INDEX(PRO,1,9))","v":"- Provincia"},null,null,null,"O1 - O2"]
[null,null,null,null,null,null,null,null,null,null,null,{"$f":"\"- \"&PROPER(IF(INDEX(RT,1,9)=\"\",INDEX(RT,1,1),INDEX(RT,1,9)))","v":"- Resp. Territorio"},null,null,null,null,null,null,null,{"$f":"\"- \"&IF(INDEX(REG,1,9)=\"\",INDEX(REG,1,1),INDEX(REG,1,9))","v":"- Regione"},null,null,null,"C2.1","C2.3","C2.4",{"$f":"_RG3&\".2\"","v":"RG.3.2"}]
[]
[{"$f":"IF(INDEX(RT,1,9)=\"\",INDEX(RT,1,1),INDEX(RT,1,9))","v":"RESP. TERRITORIO"},null,null,null,null,{"$f":"\"Responsabile \"&_RG3&\".2\"","v":"Responsabile RG.3.2"},null,null,null,null,null,null,null,null,null,{"$f":"\"- \"&IF(INDEX(TCO,1,9)=\"\",INDEX(TCO,1,1),INDEX(TCO,1,9))","v":"- Tecnici Comunali"},null,null,null,"--",null,null,null,"O1 - O2",null,"A2.1"]
[null,null,null,null,null,null,null,null,null,null,null,{"$f":"\"- \"&PROPER(IF(INDEX(CV,1,9)=\"\",INDEX(CV,1,1),INDEX(CV,1,9)))","v":"- C. Volontariato"},null,null,null,null,null,null,null,null,null,null,null,"A4","A5","A6"]
[null,null,null,null,null,null,null,null,null,null,null,{"$f":"\"- \"&PROPER(IF(INDEX(RSS,1,9)=\"\",INDEX(RSS,1,1),INDEX(RSS,1,9)))","v":"- Resp. Serv. Sociali"},null,null,null,null,null,null,null,null,null,null,null,"A7.1","A7.2","B5"]
[null,null,null,null,null,null,null,null,null,null,null,null,null,null,null,null,null,null,null,null,null,null,null,"B6","C1","C3"]
[{"$f":"IF(INDEX(CV,1,9)=\"\",INDEX(CV,1,1),INDEX(CV,1,9))","v":"C. VOLONTARIATO"},null,null,null,null,{"$f":"\"Coadiuva \"&_RG3&\".2\"","v":"Coadiuva RG.3.2"},null,null,null,null,null,"--",null,null,null,{"$f":"\"- \"&IF(INDEX(VO,1,9)=\"\",INDEX(VO,1,1),INDEX(VO,1,9))","v":"- Gruppi Volontari"},null,null,null,"--",null,null,null,"A3 - B3"]
[{"$f":"IF(INDEX(RSS,1,9)=\"\",INDEX(RSS,1,1),INDEX(RSS,1,9))","v":"RESP. SERV. SOCIALI"},null,null,null,null,{"$f":"\"Coadiuva \"&_RG3&\".2\"","v":"Coadiuva RG.3.2"},null,null,null,null,null,"--",null,null,null,{"$f":"\"- \"&IF(INDEX(SO,1,9)=\"\",INDEX(SO,1,1),INDEX(SO,1,9))","v":"- Pers. Sanitario"},null,null,null,"--",null,null,null,"B1 - C2.2 - D1"]
[{"$f":"IF(INDEX(PL,1,9)=\"\",INDEX(PL,1,1),INDEX(PL,1,9))","v":"POLIZIA LOCALE"},null,null,null,null,{"$f":"\"Responsabile \"&_RG3&\".3\"","v":"Responsabile RG.3.3"},null,null,null,null,null,{"$f":"\"- \"&PROPER(IF(INDEX(CV,1,9)=\"\",INDEX(CV,1,1),INDEX(CV,1,9)))","v":"- C. Volontariato"},null,null,null,{"$f":"\"- \"&IF(INDEX(PLO,1,9)=\"\",INDEX(PLO,1,1),INDEX(PLO,1,9))","v":"- Agenti P.L."},null,null,null,"--",null,null,null,"O1 - O2  A2.2",null,null,{"$f":"_RG3&\".3\"","v":"RG.3.3"}]
[null,null,null,null,null,null,null,null,null,null,null,{"$f":"\"- \"&PROPER(IF(INDEX(CC,1,9)=\"\",INDEX(CC,1,1),INDEX(CC,1,9)))","v":"- C. Carabinieri"},null,null,null,null,null,null,null,null,null,null,null,"M2","D2"]
[{"$f":"IF(INDEX(CV,1,9)=\"\",INDEX(CV,1,1),INDEX(CV,1,9))","v":"C. VOLONTARIATO"},null,null,null,null,{"$f":"\"Coadiuva \"&_RG3&\".3\"","v":"Coadiuva RG.3.3"},null,null,null,null,null,"--",null,null,null,{"$f":"\"- \"&IF(INDEX(VO,1,9)=\"\",INDEX(VO,1,1),INDEX(VO,1,9))","v":"- Gruppi Volontari"},null,null,null,"--",null,null,null,"A3 - B3"]
[{"$f":"IF(INDEX(CC,1,9)=\"\",INDEX(CC,1,1),INDEX(CC,1,9))","v":"C. CARABINIERI"},null,null,null,null,{"$f":"\"Coadiuva \"&_RG3&\".3\"","v":"Coadiuva RG.3.3"},null,null,null,null,null,"--",null,null,null,{"$f":"\"- \"&IF(INDEX(CO,1,9)=\"\",INDEX(CO,1,1),INDEX(CO,1,9))","v":"- Carabinieri"},null,null,null,"--",null,null,null,"--"]
[{"$f":"IF(INDEX(PL,1,9)=\"\",INDEX(PL,1,1),INDEX(PL,1,9))","v":"POLIZIA LOCALE"},null,null,null,null,"A seguito di nulla-osta dei VV.F. collabora nelle operazioni di soccorso",null,null,null,null,null,{"$f":"\"- \"&PROPER(IF(INDEX(CV,1,9)=\"\",INDEX(CV,1,1),INDEX(CV,1,9)))","v":"- C. Volontariato"},null,null,null,{"$f":"\"- \"&IF(INDEX(PLO,1,9)=\"\",INDEX(PLO,1,1),INDEX(PLO,1,9))","v":"- Agenti P.L."},null,null,null,"--",null,null,null,"O1 - O2  A2.2"]
[]
[]
[{"$f":"IF(INDEX(CV,1,9)=\"\",INDEX(CV,1,1),INDEX(CV,1,9))","v":"C. VOLONTARIATO"},null,null,null,null,"A seguito di nulla-osta dei VV.F. collabora nelle operazioni di soccorso",null,null,null,null,null,{"$f":"\"- \"&PROPER(IF(INDEX(PL,1,9)=\"\",INDEX(PL,1,1),INDEX(PL,1,9)))","v":"- Polizia Locale"},null,null,null,{"$f":"\"- \"&IF(INDEX(VO,1,9)=\"\",INDEX(VO,1,1),INDEX(VO,1,9))","v":"- Gruppi Volontari"},null,null,null,"--",null,null,null,"O1 - O2"]
[null,null,null,null,null,null,null,null,null,null,null,null,null,null,null,null,null,null,null,null,null,null,null,"A3 - B3"]
[]
["AD INTERVENTI DI SOCCORSO E MESSA IN SICUREZZA AVVENUTI"]
[{"$f":"IF(INDEX(Sindaco,1,9)=\"\",INDEX(Sindaco,1,1),INDEX(Sindaco,1,9))","v":"SINDACO / R.O.C."},null,null,null,null,"Informa periodicamente gli enti sovraordinati e i media su quanto fatto.",null,null,null,null,null,"--",null,null,null,"--",null,null,null,{"$f":"\"- \"&IF(INDEX(PR,1,9)=\"\",INDEX(PR,1,1),INDEX(PR,1,9))","v":"- Prefettura"}]
[null,null,null,null,null,null,null,null,null,null,null,null,null,null,null,null,null,null,null,{"$f":"\"- \"&IF(INDEX(PRO,1,9)=\"\",INDEX(PRO,1,1),INDEX(PRO,1,9))","v":"- Provincia"},null,null,null,"C2.1","C2.3","C2.4"]
[null,null,null,null,null,null,null,null,null,null,null,null,null,null,null,null,null,null,null,{"$f":"\"- \"&IF(INDEX(REG,1,9)=\"\",INDEX(REG,1,1),INDEX(REG,1,9))","v":"- Regione"}]
[{"$f":"IF(INDEX(Sindaco,1,9)=\"\",INDEX(Sindaco,1,1),INDEX(Sindaco,1,9))","v":"SINDACO / R.O.C."},null,null,null,null,"Informa sulla revoca dello Stato di Emergenza  e ordina il rientro degli sfollati. ",null,null,null,null,null,"- Tutti",null,null,null,{"$f":"\"- \"&IF(INDEX(SC,1,9)=\"\",INDEX(SC,1,1),INDEX(SC,1,9))","v":"- Squadre Operativi"},null,null,null,{"$f":"\"- \"&IF(INDEX(PR,1,9)=\"\",INDEX(PR,1,1),INDEX(PR,1,9))","v":"- Prefettura"},null,null,null,"O1 - O2"]
[null,null,null,null,null,null,null,null,null,null,null,null,null,null,null,null,null,null,null,{"$f":"\"- \"&IF(INDEX(PRO,1,9)=\"\",INDEX(PRO,1,1),INDEX(PRO,1,9))","v":"- Provincia"},null,null,null,"C2.1","C2.3","C2.4"]
["MEMBRI U.C.L",null,null,null,null,null,null,null,null,null,null,null,null,null,null,null,null,null,null,{"$f":"\"- \"&IF(INDEX(REG,1,9)=\"\",INDEX(REG,1,1),INDEX(REG,1,9))","v":"- Regione"},null,null,null,"M1","M2"]
[]
["PER LE COMUNICAZIONI EVIDENZIATE IN ROSSO UTILIZZARE IL MODULO FAX M4"]
[]
[]
[]
[]
[]
[{"$f":"Titolo3","v":"Scheda Procedura Operativa"},null,null,null,null,null,null,null,null,null,null,null,null,null,null,null,null,null,null,null,null,null,null,{"$f":"X4","v":"RG.3"}]
[]
[{"$f":"$A$6","v":"Rischio di Incidente Rete Metano - Fase di Emergenza"}]
[]
[]
[null,"Codice Scheda Scenario",null,null,null,null,null,{"$f":"X4","v":"RG.3"}]
[null,"Tipo di Procedure",null,null,null,null,null,{"$f":"_RG3&\".1 \"&_RG3&\".2 \"&_RG3&\".3 - AZIONI DI SALVAGUARDIA\"","v":"RG.3.1 RG.3.2 RG.3.3 - AZIONI DI SALVAGUARDIA"}]
[null,"Ubicazione intervento",null,null,null,null,null," --"]
[null,"Aree di raccolta popolazione",null,null,null,null,null,{"$f":"IF(INDEX(RG3RIC,1,1)=\"\",\"In questa fase non è prevista l’attivazione di tali aree.\",\"Per questa emergenza \"&IF(INDEX(RG3RIC,1,2)=\"\",\"è disponibile la seguente area:\",\"sono disponibili le seguenti aree:\"))","v":"Per questa emergenza sono disponibili le seguenti aree:"}]
[null,null,null,null,null,null,null,{"$f":"IF(INDEX(RG3RIC,1,1)=\"\",\"\",\"- \"&VLOOKUP(INDEX(RG3RIC,1,1),Ricovero,2))","v":"- Centro Sportivo Comunale - Carta AE.41 - Trescore Cremasco - Ricovero/Tendopoli"}]
[null,null,null,null,null,null,null,{"$f":"IF(INDEX(RG3RIC,1,2)=\"\",\"\",\"- \"&VLOOKUP(INDEX(RG3RIC,1,2),Ricovero,2))","v":"- Scuola Secondaria di I Grado \"Manzoni\" - Carta AE.42 - Trescore Cremasco - Ricovero"}]
[null,null,null,null,null,null,null,{"$f":"IF(INDEX(RG3RIC,1,3)=\"\",\"\",\"- \"&VLOOKUP(INDEX(RG3RIC,1,3),Ricovero,2))","v":"- Scuola Primaria Trescore Cremasco - Carta AE.43 - Trescore Cremasco - Ricovero"}]
[null,"Area di ricovero",null,null,null,null,null,{"$f":"IF(INDEX(RG3RIC,1,4)=\"\",\"\",\"- \"&VLOOKUP(INDEX(RG3RIC,1,4),Ricovero,2))","v":""},null,null,null,null,null,null,null,null,null,null,null,null,null,null,null,null,null,null,null,null,null,null,null,null," "]
[null,null,null,null,null,null,null,{"$f":"IF(INDEX(RG3RIC,1,5)=\"\",\"\",\"- \"&VLOOKUP(INDEX(RG3RIC,1,5),Ricovero,2))","v":""}]
[null,null,null,null,null,null,null,{"$f":"IF(INDEX(RG3RIC,1,6)=\"\",\"\",\"- \"&VLOOKUP(INDEX(RG3RIC,1,6),Ricovero,2))","v":""}]
[null,null,null,null,null,null,null,{"$f":"IF(INDEX(RG3RIC,1,7)=\"\",\"\",\"- \"&VLOOKUP(INDEX(RG3RIC,1,7),Ricovero,2))","v":""}]
[null,null,null,null,null,null,null,{"$f":"IF(H194=\"\",\"\",\"In funzione della gravità della situazione si decide quali/quante aree attivare.\")","v":"In funzione della gravità della situazione si decide quali/quante aree attivare."}]
[null,"Area di raduno soccorritori",null,null,null,null,null,{"$f":"F46","v":"Viene scelta e sgomberata in funzione della localizzazione dell'incidente."}]
[]
[]
[]
[]
[null,"Cancelli e vie alternative",null,null,null,null,null," --"]
[]
[null,"Contatti Utili",null,null,null,null,null,"Si faccia riferimento al PRONTUARIO DI EMERGENZA - CONTATTI"]
[]
[]
[]
[]
[null,null,"Procedura Operativa Standard (POS)",null,null,null,null,null,null,null,null,null,null,null,null,"Procedure Previste"]
[null,null,null,null,null,null,null,null,null,null,null,null,null,null,null,{"$f":"MID(H190,1,6)","v":"RG.3.1"},null,null,{"$f":"MID(H190,8,6)","v":"RG.3.2"},null,null,{"$f":"MID(H190,15,6)","v":"RG.3.3"}]
[null,null,1,"Monitoraggio",null,null,null,null,null,null,null,null,null,null,null,"--",null,null,"--",null,null,"--"]
[null,null,2,"Perlustrazione",null,null,null,null,null,null,null,null,null,null,null,"--",null,null,"--",null,null,"--"]
[null,null,3,"Presidio Cancelli/Supporto Viabilità",null,null,null,null,null,null,null,null,null,null,null,"X",null,null,"--",null,null,"--"]
[null,null,4,"Informazione Diretta alla Popolazione",null,null,null,null,null,null,null,null,null,null,null,"X",null,null,"--",null,null,"--"]
[null,null,5,"Allestimento Area di Ricovero",null,null,null,null,null,null,null,null,null,null,null,"--",null,null,"X",null,null,"--"]
[null,null,6,"Allestimento Area di Ammassamento Soccorsi",null,null,null,null,null,null,null,null,null,null,null,"--",null,null,"--",null,null,"--"]
[null,null,7,"Evacuazione",null,null,null,null,null,null,null,null,null,null,null,"--",null,null,"--",null,null,"X"]
[null,null,8,"Rimozione Ostacoli",null,null,null,null,null,null,null,null,null,null,null,"--",null,null,"--",null,null,"--"]
[null,null,9,"Rimozione Ostacoli da Alveo",null,null,null,null,null,null,null,null,null,null,null,"--",null,null,"--",null,null,"--"]
[null,null,10,"Preservazione Argini",null,null,null,null,null,null,null,null,null,null,null,"--",null,null,"--",null,null,"--"]
[null,null,11,"Frana",null,null,null,null,null,null,null,null,null,null,null,"--",null,null,"--",null,null,"--"]

{"sheet":"MR_3","index":11,"n_rows":225,"n_cols":27,"rows_kept":225,"cut":false,"hidden":false,"merged":[[130,0,131,4],[130,5,131,10],[130,11,131,14],[130,15,131,18],[207,7,208,24],[195,1,199,6],[195,7,195,24],[196,7,196,24],[197,7,197,24],[198,7,198,24],[199,7,199,24],[200,1,204,6],[163,23,163,24],[173,23,173,25],[169,23,169,25],[167,5,167,10],[167,11,167,14],[167,15,167,18],[167,19,167,22],[167,23,167,25],[134,0,134,25],[135,0,137,4],[135,5,137,10],[135,11,137,14],[130,19,131,22],[130,23,131,25],[60,10,60,24],[60,1,61,9],[61,10,61,24],[123,0,124,22],[123,23,126,25],[125,0,126,22],[135,15,137,18],[135,19,137,22],[132,15,132,18],[133,15,133,18],[132,0,133,4],[132,5,133,10],[132,11,133,14],[132,19,133,22],[132,23,133,25],[135,23,135,25],[136,23,136,25],[137,23,137,25],[21,17,23,24],[21,10,21,16],[22,10,22,16],[23,10,23,16],[54,1,58,9],[54,10,58,24],[59,1,59,9],[59,10,59,24],[128,0,129,4],[128,5,129,10],[128,11,129,14],[128,15,129,18],[128,19,129,22],[128,23,129,25],[63,0,64,22],[63,23,66,25],[65,0,66,22],[51,1,53,9],[51,11,51,24],[52,11,52,24],[53,11,53,24],[38,5,38,24],[39,5,39,24],[40,5,40,24],[41,5,41,24],[42,5,42,24],[43,5,43,24],[44,5,47,24],[0,0,1,6],[0,7,1,18],[0,19,1,25],[3,0,4,22],[3,23,6,25],[5,0,6,22],[21,1,23,9],[8,1,8,9],[8,10,8,24],[9,1,9,9],[9,10,9,24],[10,1,15,9],[10,10,15,24],[16,1,18,9],[16,10,18,24],[19,1,20,9],[19,10,20,24],[145,11,147,14],[145,15,147,18],[145,19,145,22],[146,19,146,22],[147,0,147,4],[147,19,147,22],[145,23,145,25],[24,1,26,9],[24,10,26,24],[27,1,30,9],[31,1,34,9],[31,10,34,24],[48,1,50,9],[48,10,48,24],[49,10,49,24],[50,10,50,24],[27,10,29,24],[30,10,30,24],[35,1,38,4],[39,1,43,4],[44,1,47,4],[35,5,35,24],[36,5,36,24],[37,5,37,24],[149,5,150,10],[149,11,150,14],[149,15,150,18],[149,19,150,22],[149,23,150,25],[138,26,143,26],[142,0,142,4],[142,5,142,10],[142,11,142,14],[142,15,142,18],[142,19,142,22],[142,23,142,25],[143,0,143,4],[143,5,143,10],[143,11,143,14],[138,0,141,4],[138,5,141,10],[138,11,141,14],[138,15,141,18],[138,19,141,22],[138,23,141,25],[148,0,148,25],[145,0,146,4],[145,5,147,10],[143,15,143,18],[144,0,144,25],[151,26,158,26],[154,0,157,4],[154,5,157,10],[154,15,157,18],[154,19,157,22],[158,0,158,4],[158,5,158,10],[158,11,158,14],[151,0,153,4],[151,5,153,10],[151,11,153,14],[151,15,153,18],[151,19,153,22],[151,23,153,25],[158,15,158,18],[158,19,158,22],[158,23,158,25],[154,23,154,24],[154,11,157,14],[143,19,143,22],[143,23,143,25],[149,0,150,4],[161,26,168,26],[162,19,162,22],[163,0,166,4],[163,5,166,10],[163,15,166,18],[163,19,166,22],[164,11,164,14],[165,11,165,14],[167,0,167,4],[159,0,162,4],[159,5,162,10],[159,15,162,18],[159,19,159,22],[160,19,160,22],[161,19,161,22],[168,23,168,25],[160,23,160,25],[168,0,168,4],[168,5,168,10],[169,26,172,26],[170,11,170,14],[171,0,171,4],[171,5,171,10],[171,11,171,14],[171,15,171,18],[171,19,171,22],[171,23,171,25],[172,0,172,4],[169,0,170,4],[169,5,170,10],[169,11,169,14],[169,15,170,18],[169,19,170,22],[172,5,172,10],[172,11,172,14],[172,15,172,18],[172,19,172,22],[172,23,172,25],[205,1,206,6],[205,7,206,24],[207,1,208,6],[175,0,175,4],[168,11,168,14],[168,15,168,18],[168,19,168,22],[175,19,175,22],[183,0,184,22],[183,23,186,25],[185,0,186,22],[177,0,177,25],[173,0,174,4],[173,5,175,10],[173,11,175,14],[173,15,175,18],[173,19,173,22],[174,19,174,22],[200,7,204,24],[188,1,188,6],[188,7,188,24],[189,1,189,6],[189,7,189,24],[190,1,190,6],[190,7,190,24],[191,1,194,6],[191,7,191,24],[192,7,192,24],[193,7,193,24],[194,7,194,24],[217,22,217,24],[218,13,218,15],[216,16,216,18],[216,19,216,21],[217,13,217,15],[217,16,217,18],[217,19,217,21],[216,2,216,12],[215,13,215,15],[215,16,215,18],[215,19,215,21],[217,2,217,12],[215,2,215,12],[216,22,216,24],[215,22,215,24],[216,13,216,15],[212,1,213,12],[212,13,212,24],[214,13,214,15],[214,16,214,18],[214,19,214,21],[214,22,214,24],[213,13,213,15],[213,16,213,18],[213,19,213,21],[213,22,213,24],[214,2,214,12],[219,16,219,18],[219,19,219,21],[219,22,219,24],[220,13,220,15],[220,16,220,18],[220,19,220,21],[220,22,220,24],[218,2,218,12],[219,2,219,12],[220,2,220,12],[224,2,224,12],[224,13,224,15],[221,19,221,21],[221,22,221,24],[218,16,218,18],[218,19,218,21],[218,22,218,24],[223,13,223,15],[223,16,223,18],[223,19,223,21],[223,22,223,24],[221,2,221,12],[222,2,222,12],[223,2,223,12],[221,13,221,15],[221,16,221,18],[222,13,222,15],[222,16,222,18],[222,19,222,21],[222,22,222,24],[224,16,224,18],[224,19,224,21],[224,22,224,24],[219,13,219,15]]}
[{"$f":"NCOM&\" (\"&PCOM&\")\"","v":"Comune di Trescore Cremasco (CR)"},null,null,null,null,null,null,{"$f":"IF(INDEX(INT,1,13)=\"\",INDEX(INT,1,1),INDEX(INT,1,13))","v":"Piano di Emergenza Intercomunale di Protezione Civile"},null,null,null,null,null,null,null,null,null,null,null,{"$f":"IF(TIPOP=\"Edizione\",\"Ed. \",IF(TIPOP=\"Revisione\",\"Rev. \",\"Bozza \"))&TIPON&\" del \"&TIPOD","v":"Ed. 01 del 04/11/2012"}]
[]
[]
["Scheda Scenario",null,null,null,null,null,null,null,null,null,null,null,null,null,null,null,null,null,null,null,null,null,null,{"$f":"_MRI3","v":"MR.3"}]
[]
[{"$f":"IF(INDEX(MR3PAR,1,19)=\"\",INDEX(MR3PAR,1,12),INDEX(MR3PAR,1,19))","v":"Rischio Dispersione Materiale Radioattivo"}]
[]
[]
[null,"Paragrafi di Riferimento ",null,null,null,null,null,null,null,null,{"$f":"INDEX(MR3PAR,1,1)&INDEX(MR3PAR,1,12)","v":"2.2.7 - 3.3.4 Procedure per Perdita di Materiale Radioattivo"}]
[null,"Codice Scheda",null,null,null,null,null,null,null,null,{"$f":"X4","v":"MR.3"}]
[null,"Evento atteso",null,null,null,null,null,null,null,null,"Incidente che abbia come conseguenza la dispersione di sostanze radioattive o ritrovamento di materie radioattive, comunque confezionate, e di apparecchi contenenti dette materie."]
[]
[]
[]
[]
[]
[null,"Attività U.C.L.",null,null,null,null,null,null,null,null,"Informa le autorità preposte e isola ed evacua la zona interessata."]
[]
[]
[null,"Ubicazione intervento",null,null,null,null,null,null,null,null,"Aree limitrofe all'incidente."]
[]
[null,"Personale mobilitato",null,null,null,null,null,null,null,null,{"$f":"IF(INDEX(MR3PER,1,1)=\"\",\"\",\"- \"&VLOOKUP(INDEX(MR3PER,1,1),Personale,IF(INDEX(Personale,INDEX(MR3PER,1,1),14)=\"\",2,14)))","v":"- Polizia Locale"},null,null,null,null,null,null,"Riportare la composizione delle squadre nel Modulo M1"]
[null,null,null,null,null,null,null,null,null,null,{"$f":"IF(INDEX(MR3PER,1,2)=\"\",\"\",\"- \"&VLOOKUP(INDEX(MR3PER,1,2),Personale,IF(INDEX(Personale,INDEX(MR3PER,1,2),14)=\"\",2,14)))","v":"- Volontari P.C."}]
[null,null,null,null,null,null,null,null,null,null,{"$f":"IF(INDEX(MR3PER,1,3)=\"\",\"\",\"- \"&VLOOKUP(INDEX(MR3PER,1,3),Personale,IF(INDEX(Personale,INDEX(MR3PER,1,3),14)=\"\",2,14)))","v":"- Tecnici/Operai Comunali"}]
[null,"Attività personale mobilitato",null,null,null,null,null,null,null,null,"Assistenza alla popolazione e isolamento della zona interessata in accordo al piano di emergenza comunale."]
[]
[]
[null,"Grado di coinvolgimento della popolazione",null,null,null,null,null,null,null,null,"Dipende dall'ampiezza della zona colpita. Si procede con l'informare la popolazione interessata sulle precauzioni da prendere e si evacuano le persone che si trovano nelle zone a maggior rischio."]
[]
[]
[null,null,null,null,null,null,null,null,null,null,"Registrare le persone eventualmente evacuate nel Modulo M2"]
[null,"Cancelli e vie alternative",null,null,null,null,null,null,null,null,"Vengono posizionati dei cancelli finalizzati alla regolazione del traffico nelle zone interessate. "]
[]
[]
[]
[null,"Aree di raccolta popolazione",null,null,null,{"$f":"IF(INDEX(MR3RIC,1,1)=\"\",\"In questa fase non è prevista l’attivazione di tali aree.\",\"Per questa emergenza \"&IF(INDEX(MR3RIC,1,2)=\"\",\"è disponibile la seguente area:\",\"sono disponibili le seguenti aree:\"))","v":"Per questa emergenza sono disponibili le seguenti aree:"}]
[null,null,null,null,null,{"$f":"IF(INDEX(MR3RIC,1,1)=\"\",\"\",\"- \"&VLOOKUP(INDEX(MR3RIC,1,1),Ricovero,2))","v":"- Centro Sportivo Comunale - Carta AE.41 - Trescore Cremasco - Ricovero/Tendopoli"}]
[null,null,null,null,null,{"$f":"IF(INDEX(MR3RIC,1,2)=\"\",\"\",\"- \"&VLOOKUP(INDEX(MR3RIC,1,2),Ricovero,2))","v":"- Scuola Secondaria di I Grado \"Manzoni\" - Carta AE.42 - Trescore Cremasco - Ricovero"}]
[null,null,null,null,null,{"$f":"IF(INDEX(MR3RIC,1,3)=\"\",\"\",\"- \"&VLOOKUP(INDEX(MR3RIC,1,3),Ricovero,2))","v":"- Scuola Primaria Trescore Cremasco - Carta AE.43 - Trescore Cremasco - Ricovero"}]
[null,"Area di ricovero",null,null,null,{"$f":"IF(INDEX(MR3RIC,1,4)=\"\",\"\",\"- \"&VLOOKUP(INDEX(MR3RIC,1,4),Ricovero,2))","v":""}]
[null,null,null,null,null,{"$f":"IF(INDEX(MR3RIC,1,5)=\"\",\"\",\"- \"&VLOOKUP(INDEX(MR3RIC,1,5),Ricovero,2))","v":""}]
[null,null,null,null,null,{"$f":"IF(INDEX(MR3RIC,1,6)=\"\",\"\",\"- \"&VLOOKUP(INDEX(MR3RIC,1,6),Ricovero,2))","v":""}]
[null,null,null,null,null,{"$f":"IF(INDEX(MR3RIC,1,7)=\"\",\"\",\"- \"&VLOOKUP(INDEX(MR3RIC,1,7),Ricovero,2))","v":""}]
[null,null,null,null,null,{"$f":"IF(F38=\"\",\"\",\"In funzione della gravità della situazione si decide quali/quante aree attivare.\")","v":"In funzione della gravità della situazione si decide quali/quante aree attivare."}]
[null,"Area di raduno soccorritori",null,null,null,"Viene scelta e sgomberata in funzione della localizzazione dell'incidente."]
[]
[]
[]
[null,"Ordinanze Necessarie",null,null,null,null,null,null,null,null,"Ordinanza di Evacuazione;"]
[null,null,null,null,null,null,null,null,null,null,"Ordinanza di Chiusura Strade."]
[]
[null,"Modalita’ Riunione U.C.L.",null,null,null,null,null,null,null,null,null,"Non necessaria"]
[null,null,null,null,null,null,null,null,null,null,"X","Virtuale"]
[null,null,null,null,null,null,null,null,null,null,"X","In sede"]
[null,"Possibili Scenari Concomitanti",null,null,null,null,null,null,null,null,"Non ragionevolmente prevedibile la concomitanza con altri eventi."]
[]
[]
[]
[]
[null,"Contatti Utili",null,null,null,null,null,null,null,null,{"$f":"\"Consultare il \"&IF([1]Maschera!Z71=\"\",[1]Maschera!N71,[1]Maschera!Z71)","v":"Consultare il Tomo Giallo - Risorse"}]
[null,"Cartografia",null,null,null,null,null,null,null,null,{"$f":"INDEX(MR3PAR,1,28)","v":"Tav. 3/B - Rischio Industriale"}]
[null,null,null,null,null,null,null,null,null,null,{"$f":"INDEX(MR3PAR,1,39)","v":"Tav. 3/D - Stradario Piano di Emergenza"}]
[]
[{"$f":"Titolo2","v":"Procedure U.C.L."},null,null,null,null,null,null,null,null,null,null,null,null,null,null,null,null,null,null,null,null,null,null,{"$f":"_MRI3","v":"MR.3"}]
[]
[{"$f":"$A$6","v":"Rischio Dispersione Materiale Radioattivo"}]
[]
[]
[]
[]
[]
[]
[]
[]
[]
[]
[]
[]
[]
[]
[]
[]
[]
[]
[]
[]
[]
[]
[]
[]
[]
[]
[]
[]
[]
[]
[]
[]
[]
[]
[]
[]
[]
[]
[]
[]
[]
[]
[]
[]
[]
[]
[]
[]
[]
[]
[]
[]
[]
[]
[]
[]
[]
[{"$f":"Titolo2","v":"Procedure U.C.L."},null,null,null,null,null,null,null,null,null,null,null,null,null,null,null,null,null,null,null,null,null,null,{"$f":"X4","v":"MR.3"}]
[]
[{"$f":"$A$6","v":"Rischio Dispersione Materiale Radioattivo"}]
[]
[]
["RESPONSABILE",null,null,null,null,"AZIONE",null,null,null,null,null,"MEMBRO UCL",null,null,null,"OPERATIVI",null,null,null,"ENTE INTERESSATO",null,null,null,"SCHEDE CHIAMATE"]
[]
[{"$f":"IF(INDEX(PL,1,9)=\"\",INDEX(PL,1,1),INDEX(PL,1,9))","v":"POLIZIA LOCALE"},null,null,null,null,"Effettua sopralluogo nell'area interessata.",null,null,null,null,null,{"$f":"\"- \"&PROPER(IF(INDEX(RT,1,9)=\"\",INDEX(RT,1,1),INDEX(RT,1,9)))","v":"- Resp. Territorio"},null,null,null,{"$f":"\"- \"&IF(INDEX(PLO,1,9)=\"\",INDEX(PLO,1,1),INDEX(PLO,1,9))","v":"- Agenti P.L."},null,null,null,"--",null,null,null,"O1 - O2  A2.2"]
[]
[{"$f":"IF(INDEX(RT,1,9)=\"\",INDEX(RT,1,1),INDEX(RT,1,9))","v":"RESP. TERRITORIO"},null,null,null,null,"Collabora nell'organizzazione del sopralluogo.",null,null,null,null,null,"--",null,null,null,{"$f":"\"- \"&IF(INDEX(TCO,1,9)=\"\",INDEX(TCO,1,1),INDEX(TCO,1,9))","v":"- Tecnici Comunali"},null,null,null,"--",null,null,null,"A2.1  B2  C3"]
[null,null,null,null,null,null,null,null,null,null,null,null,null,null,null,{"$f":"\"- \"&IF(INDEX(PTO,1,9)=\"\",INDEX(PTO,1,1),INDEX(PTO,1,9))","v":"- Professionisti"}]
["SE L'INCIDENTE COINVOLGE SOSTANZE RADIOATTIVE"]
[{"$f":"IF(INDEX(Sindaco,1,9)=\"\",INDEX(Sindaco,1,1),INDEX(Sindaco,1,9))","v":"SINDACO / R.O.C."},null,null,null,null,"Attiva l'UCL e avverte gli Enti sovraordinati",null,null,null,null,null,"- Tutti",null,null,null,{"$f":"\"- \"&IF(INDEX(VF,1,9)=\"\",INDEX(VF,1,1),INDEX(VF,1,9))","v":"- VV.F."},null,null,null,{"$f":"\"- \"&IF(INDEX(PR,1,9)=\"\",INDEX(PR,1,1),INDEX(PR,1,9))","v":"- Prefettura"}]
[null,null,null,null,null,null,null,null,null,null,null,null,null,null,null,null,null,null,null,null,null,null,null,"O1 - O2  C2.1"]
[]
[{"$f":"IF(INDEX(Sindaco,1,9)=\"\",INDEX(Sindaco,1,1),INDEX(Sindaco,1,9))","v":"SINDACO / R.O.C."},null,null,null,null,{"$f":"\"In accordo con gli Enti preposti organizza cancelli per il traffico e informa la popolazione. \"&_MRI3&\".1\"","v":"In accordo con gli Enti preposti organizza cancelli per il traffico e informa la popolazione. MR.3.1"},null,null,null,null,null,{"$f":"\"- \"&PROPER(IF(INDEX(PL,1,9)=\"\",INDEX(PL,1,1),INDEX(PL,1,9)))","v":"- Polizia Locale"},null,null,null,"--",null,null,null,"--",null,null,null,"O1 - O2  C2.3",null,null,{"$f":"_MRI3&\".1\"","v":"MR.3.1"}]
[]
[]
[]
[{"$f":"IF(INDEX(PL,1,9)=\"\",INDEX(PL,1,1),INDEX(PL,1,9))","v":"POLIZIA LOCALE"},null,null,null,null,{"$f":"\"Responsabile \"&_MRI3&\".1\"","v":"Responsabile MR.3.1"},null,null,null,null,null,{"$f":"\"- \"&PROPER(IF(INDEX(CC,1,9)=\"\",INDEX(CC,1,1),INDEX(CC,1,9)))","v":"- C. Carabinieri"},null,null,null,{"$f":"\"- \"&IF(INDEX(PLO,1,9)=\"\",INDEX(PLO,1,1),INDEX(PLO,1,9))","v":"- Agenti P.L."},null,null,null,"--",null,null,null,"O1 - O2  A2.2"]
[{"$f":"IF(INDEX(CC,1,9)=\"\",INDEX(CC,1,1),INDEX(CC,1,9))","v":"C. CARABINIERI"},null,null,null,null,{"$f":"\"Coadiuva \"&_MRI3&\".1\"","v":"Coadiuva MR.3.1"},null,null,null,null,null,"--",null,null,null,{"$f":"\"- \"&IF(INDEX(CO,1,9)=\"\",INDEX(CO,1,1),INDEX(CO,1,9))","v":"- Carabinieri"},null,null,null,"--",null,null,null,"--"]
["SE NON VIENE ACCERTATA CONTAMINAZIONE"]
[{"$f":"IF(INDEX(Sindaco,1,9)=\"\",INDEX(Sindaco,1,1),INDEX(Sindaco,1,9))","v":"SINDACO / R.O.C."},null,null,null,null,"Informa sulla revoca dello Stato di Emergenza  e ordina il rientro degli sfollati. ",null,null,null,null,null,"- Tutti",null,null,null,{"$f":"\"- \"&IF(INDEX(SC,1,9)=\"\",INDEX(SC,1,1),INDEX(SC,1,9))","v":"- Squadre Operativi"},null,null,null,{"$f":"\"- \"&IF(INDEX(PR,1,9)=\"\",INDEX(PR,1,1),INDEX(PR,1,9))","v":"- Prefettura"},null,null,null,"O1 - O2"]
[null,null,null,null,null,null,null,null,null,null,null,null,null,null,null,null,null,null,null,{"$f":"\"- \"&IF(INDEX(PRO,1,9)=\"\",INDEX(PRO,1,1),INDEX(PRO,1,9))","v":"- Provincia"},null,null,null,"C2.1","C2.3","C2.4"]
["MEMBRI U.C.L",null,null,null,null,null,null,null,null,null,null,null,null,null,null,null,null,null,null,{"$f":"\"- \"&IF(INDEX(REG,1,9)=\"\",INDEX(REG,1,1),INDEX(REG,1,9))","v":"- Regione"},null,null,null,"M1","M2"]
["SE VIENE ACCERTATA CONTAMINAZIONE"]
[{"$f":"IF(INDEX(Sindaco,1,9)=\"\",INDEX(Sindaco,1,1),INDEX(Sindaco,1,9))","v":"SINDACO / R.O.C."},null,null,null,null,{"$f":"\"Si coordina con il \"&COM","v":"Si coordina con il COM Monza"},null,null,null,null,null,"--",null,null,null,"--",null,null,null,{"$f":"\"- \"&COM","v":"- COM Monza"},null,null,null,"C2.1"]
[]
[{"$f":"IF(INDEX(Sindaco,1,9)=\"\",INDEX(Sindaco,1,1),INDEX(Sindaco,1,9))","v":"SINDACO / R.O.C."},null,null,null,null,{"$f":"\"Su segnalazione del COM attiva le aree ammassamento soccorsi. \"&_MRI3&\".2\"","v":"Su segnalazione del COM attiva le aree ammassamento soccorsi. MR.3.2"},null,null,null,null,null,{"$f":"\"- \"&PROPER(IF(INDEX(RT,1,9)=\"\",INDEX(RT,1,1),INDEX(RT,1,9)))","v":"- Resp. Territorio"},null,null,null,"--",null,null,null,"--",null,null,null,"O1 - O2",null,null,{"$f":"_MRI3&\".2\"","v":"MR.3.2"}]
[]
[]
[{"$f":"IF(INDEX(RT,1,9)=\"\",INDEX(RT,1,1),INDEX(RT,1,9))","v":"RESP. TERRITORIO"},null,null,null,null,{"$f":"\"Responsabile \"&_MRI3&\".2\"","v":"Responsabile MR.3.2"},null,null,null,null,null,{"$f":"\"- \"&PROPER(IF(INDEX(CV,1,9)=\"\",INDEX(CV,1,1),INDEX(CV,1,9)))","v":"- C. Volontariato"},null,null,null,{"$f":"\"- \"&IF(INDEX(TCO,1,9)=\"\",INDEX(TCO,1,1),INDEX(TCO,1,9))","v":"- Tecnici Comunali"},null,null,null,"--",null,null,null,"O1 - O2",null,"A2.1"]
[null,null,null,null,null,null,null,null,null,null,null,null,null,null,null,null,null,null,null,null,null,null,null,"A4","A5","A6"]
[null,null,null,null,null,null,null,null,null,null,null,null,null,null,null,null,null,null,null,null,null,null,null,"A8","B5","B6"]
[null,null,null,null,null,null,null,null,null,null,null,null,null,null,null,null,null,null,null,null,null,null,null,"C1"]
[{"$f":"IF(INDEX(CV,1,9)=\"\",INDEX(CV,1,1),INDEX(CV,1,9))","v":"C. VOLONTARIATO"},null,null,null,null,{"$f":"\"Coadiuva \"&_MRI3&\".2\"","v":"Coadiuva MR.3.2"},null,null,null,null,null,"--",null,null,null,{"$f":"\"- \"&IF(INDEX(VO,1,9)=\"\",INDEX(VO,1,1),INDEX(VO,1,9))","v":"- Gruppi Volontari"},null,null,null,"--",null,null,null,"A3 - B3"]
[{"$f":"IF(INDEX(Sindaco,1,9)=\"\",INDEX(Sindaco,1,1),INDEX(Sindaco,1,9))","v":"SINDACO / R.O.C."},null,null,null,null,{"$f":"\"Su segnalazione del COM attiva le aree di emergenza (\"&_MRI3&\".3),\"&\" e dispone le evacuazioni.  (\"&_MRI3&\".4 ).\"","v":"Su segnalazione del COM attiva le aree di emergenza (MR.3.3), e dispone le evacuazioni.  (MR.3.4 )."},null,null,null,null,null,null,null,null,null,"--",null,null,null,{"$f":"\"- \"&IF(INDEX(PR,1,9)=\"\",INDEX(PR,1,1),INDEX(PR,1,9))","v":"- Prefettura"}]
[null,null,null,null,null,null,null,null,null,null,null,{"$f":"\"- \"&PROPER(IF(INDEX(PL,1,9)=\"\",INDEX(PL,1,1),INDEX(PL,1,9)))","v":"- Polizia Locale"},null,null,null,null,null,null,null,{"$f":"\"- \"&IF(INDEX(PRO,1,9)=\"\",INDEX(PRO,1,1),INDEX(PRO,1,9))","v":"- Provincia"},null,null,null,"O1 - O2"]
[null,null,null,null,null,null,null,null,null,null,null,{"$f":"\"- \"&PROPER(IF(INDEX(RT,1,9)=\"\",INDEX(RT,1,1),INDEX(RT,1,9)))","v":"- Resp. Territorio"},null,null,null,null,null,null,null,{"$f":"\"- \"&IF(INDEX(REG,1,9)=\"\",INDEX(REG,1,1),INDEX(REG,1,9))","v":"- Regione"},null,null,null,"C2.1","C2.3","C2.4",{"$f":"_MRI3&\".3\"","v":"MR.3.3"}]
[]
[{"$f":"IF(INDEX(RT,1,9)=\"\",INDEX(RT,1,1),INDEX(RT,1,9))","v":"RESP. TERRITORIO"},null,null,null,null,{"$f":"\"Responsabile \"&_MRI3&\".3\"","v":"Responsabile MR.3.3"},null,null,null,null,null,null,null,null,null,{"$f":"\"- \"&IF(INDEX(TCO,1,9)=\"\",INDEX(TCO,1,1),INDEX(TCO,1,9))","v":"- Tecnici Comunali"},null,null,null,"--",null,null,null,"O1 - O2",null,"A2.1"]
[null,null,null,null,null,null,null,null,null,null,null,{"$f":"\"- \"&PROPER(IF(INDEX(CV,1,9)=\"\",INDEX(CV,1,1),INDEX(CV,1,9)))","v":"- C. Volontariato"},null,null,null,null,null,null,null,null,null,null,null,"A4","A5","A6"]
[null,null,null,null,null,null,null,null,null,null,null,{"$f":"\"- \"&PROPER(IF(INDEX(RSS,1,9)=\"\",INDEX(RSS,1,1),INDEX(RSS,1,9)))","v":"- Resp. Serv. Sociali"},null,null,null,null,null,null,null,null,null,null,null,"A7.1","A7.2","B5"]
[null,null,null,null,null,null,null,null,null,null,null,null,null,null,null,null,null,null,null,null,null,null,null,"B6","C1","C3"]
[{"$f":"IF(INDEX(CV,1,9)=\"\",INDEX(CV,1,1),INDEX(CV,1,9))","v":"C. VOLONTARIATO"},null,null,null,null,{"$f":"\"Coadiuva \"&_MRI3&\".3\"","v":"Coadiuva MR.3.3"},null,null,null,null,null,"--",null,null,null,{"$f":"\"- \"&IF(INDEX(VO,1,9)=\"\",INDEX(VO,1,1),INDEX(VO,1,9))","v":"- Gruppi Volontari"},null,null,null,"--",null,null,null,"A3 - B3"]
[{"$f":"IF(INDEX(RSS,1,9)=\"\",INDEX(RSS,1,1),INDEX(RSS,1,9))","v":"RESP. SERV. SOCIALI"},null,null,null,null,{"$f":"\"Coadiuva \"&_MRI3&\".3\"","v":"Coadiuva MR.3.3"},null,null,null,null,null,"--",null,null,null,{"$f":"\"- \"&IF(INDEX(SO,1,9)=\"\",INDEX(SO,1,1),INDEX(SO,1,9))","v":"- Pers. Sanitario"},null,null,null,"--",null,null,null,"B1 - C2.2 - D1"]
[{"$f":"IF(INDEX(PL,1,9)=\"\",INDEX(PL,1,1),INDEX(PL,1,9))","v":"POLIZIA LOCALE"},null,null,null,null,{"$f":"\"Responsabile \"&_MRI3&\".4\"","v":"Responsabile MR.3.4"},null,null,null,null,null,{"$f":"\"- \"&PROPER(IF(INDEX(CV,1,9)=\"\",INDEX(CV,1,1),INDEX(CV,1,9)))","v":"- C. Volontariato"},null,null,null,{"$f":"\"- \"&IF(INDEX(PLO,1,9)=\"\",INDEX(PLO,1,1),INDEX(PLO,1,9))","v":"- Agenti P.L."},null,null,null,"--",null,null,null,"O1 - O2  A2.2",null,null,{"$f":"_MRI3&\".4\"","v":"MR.3.4"}]
[null,null,null,null,null,null,null,null,null,null,null,{"$f":"\"- \"&PROPER(IF(INDEX(CC,1,9)=\"\",INDEX(CC,1,1),INDEX(CC,1,9)))","v":"- C. Carabinieri"},null,null,null,null,null,null,null,null,null,null,null,"M2","D2"]
[{"$f":"IF(INDEX(CV,1,9)=\"\",INDEX(CV,1,1),INDEX(CV,1,9))","v":"C. VOLONTARIATO"},null,null,null,null,{"$f":"\"Coadiuva \"&_MRI3&\".4\"","v":"Coadiuva MR.3.4"},null,null,null,null,null,"--",null,null,null,{"$f":"\"- \"&IF(INDEX(VO,1,9)=\"\",INDEX(VO,1,1),INDEX(VO,1,9))","v":"- Gruppi Volontari"},null,null,null,"--",null,null,null,"A3 - B3"]
[{"$f":"IF(INDEX(CC,1,9)=\"\",INDEX(CC,1,1),INDEX(CC,1,9))","v":"C. CARABINIERI"},null,null,null,null,{"$f":"\"Coadiuva \"&_MRI3&\".4\"","v":"Coadiuva MR.3.4"},null,null,null,null,null,"--",null,null,null,{"$f":"\"- \"&IF(INDEX(CO,1,9)=\"\",INDEX(CO,1,1),INDEX(CO,1,9))","v":"- Carabinieri"},null,null,null,"--",null,null,null,"--"]
[{"$f":"IF(INDEX(Sindaco,1,9)=\"\",INDEX(Sindaco,1,1),INDEX(Sindaco,1,9))","v":"SINDACO / R.O.C."},null,null,null,null,"Informa sulla revoca dello Stato di Emergenza  e ordina il rientro degli sfollati. ",null,null,null,null,null,"- Tutti",null,null,null,{"$f":"\"- \"&IF(INDEX(SC,1,9)=\"\",INDEX(SC,1,1),INDEX(SC,1,9))","v":"- Squadre Operativi"},null,null,null,{"$f":"\"- \"&IF(INDEX(PR,1,9)=\"\",INDEX(PR,1,1),INDEX(PR,1,9))","v":"- Prefettura"},null,null,null,"O1 - O2"]
[null,null,null,null,null,null,null,null,null,null,null,null,null,null,null,null,null,null,null,{"$f":"\"- \"&IF(INDEX(PRO,1,9)=\"\",INDEX(PRO,1,1),INDEX(PRO,1,9))","v":"- Provincia"},null,null,null,"C2.1","C2.3","C2.4"]
["MEMBRI U.C.L",null,null,null,null,null,null,null,null,null,null,null,null,null,null,null,null,null,null,{"$f":"\"- \"&IF(INDEX(REG,1,9)=\"\",INDEX(REG,1,1),INDEX(REG,1,9))","v":"- Regione"},null,null,null,"M1","M2"]
[]
["PER LE COMUNICAZIONI EVIDENZIATE IN ROSSO UTILIZZARE IL MODULO FAX M4"]
[]
[]
[]
[]
[]
[{"$f":"Titolo3","v":"Scheda Procedura Operativa"},null,null,null,null,null,null,null,null,null,null,null,null,null,null,null,null,null,null,null,null,null,null,{"$f":"X4","v":"MR.3"}]
[]
[{"$f":"$A$6","v":"Rischio Dispersione Materiale Radioattivo"}]
[]
[]
[null,"Codice Scheda Scenario",null,null,null,null,null,{"$f":"X4","v":"MR.3"}]
[null,"Tipo di Procedure",null,null,null,null,null,{"$f":"_MRI3&\".1 \"&_MRI3&\".2 \"&_MRI3&\".3 \"&_MRI3&\".4 - AZIONI DI SALVAGUARDIA\"","v":"MR.3.1 MR.3.2 MR.3.3 MR.3.4 - AZIONI DI SALVAGUARDIA"}]
[null,"Ubicazione intervento",null,null,null,null,null," --"]
[null,"Aree di raccolta popolazione",null,null,null,null,null,{"$f":"IF(INDEX(MR3RIC,1,1)=\"\",\"In questa fase non è prevista l’attivazione di tali aree.\",\"Per questa emergenza \"&IF(INDEX(MR3RIC,1,2)=\"\",\"è disponibile la seguente area:\",\"sono disponibili le seguenti aree:\"))","v":"Per questa emergenza sono disponibili le seguenti aree:"}]
[null,null,null,null,null,null,null,{"$f":"IF(INDEX(MR3RIC,1,1)=\"\",\"\",\"- \"&VLOOKUP(INDEX(MR3RIC,1,1),Ricovero,2))","v":"- Centro Sportivo Comunale - Carta AE.41 - Trescore Cremasco - Ricovero/Tendopoli"}]
[null,null,null,null,null,null,null,{"$f":"IF(INDEX(MR3RIC,1,2)=\"\",\"\",\"- \"&VLOOKUP(INDEX(MR3RIC,1,2),Ricovero,2))","v":"- Scuola Secondaria di I Grado \"Manzoni\" - Carta AE.42 - Trescore Cremasco - Ricovero"}]
[null,null,null,null,null,null,null,{"$f":"IF(INDEX(MR3RIC,1,3)=\"\",\"\",\"- \"&VLOOKUP(INDEX(MR3RIC,1,3),Ricovero,2))","v":"- Scuola Primaria Trescore Cremasco - Carta AE.43 - Trescore Cremasco - Ricovero"}]
[null,"Area di ricovero",null,null,null,null,null,{"$f":"IF(INDEX(MR3RIC,1,4)=\"\",\"\",\"- \"&VLOOKUP(INDEX(MR3RIC,1,4),Ricovero,2))","v":""}]
[null,null,null,null,null,null,null,{"$f":"IF(INDEX(MR3RIC,1,5)=\"\",\"\",\"- \"&VLOOKUP(INDEX(MR3RIC,1,5),Ricovero,2))","v":""}]
[null,null,null,null,null,null,null,{"$f":"IF(INDEX(MR3RIC,1,6)=\"\",\"\",\"- \"&VLOOKUP(INDEX(MR3RIC,1,6),Ricovero,2))","v":""}]
[null,null,null,null,null,null,null,{"$f":"IF(INDEX(MR3RIC,1,7)=\"\",\"\",\"- \"&VLOOKUP(INDEX(MR3RIC,1,7),Ricovero,2))","v":""}]
[null,null,null,null,null,null,null,{"$f":"IF(H194=\"\",\"\",\"In funzione della gravità della situazione si decide quali/quante aree attivare.\")","v":"In funzione della gravità della situazione si decide quali/quante aree attivare."}]
[null,"Area di raduno soccorritori",null,null,null,null,null,{"$f":"$F$45","v":"Viene scelta e sgomberata in funzione della localizzazione dell'incidente."}]
[]
[]
[]
[]
[null,"Cancelli e vie alternative",null,null,null,null,null," --"]
[]
[null,"Contatti Utili",null,null,null,null,null,"Si faccia riferimento al PRONTUARIO DI EMERGENZA - CONTATTI"]
[]
[]
[]
[]
[null,"Procedura Operativa Standard (POS)",null,null,null,null,null,null,null,null,null,null,null,"Procedure Previste"]
[null,null,null,null,null,null,null,null,null,null,null,null,null,{"$f":"MID(H190,1,6)","v":"MR.3.1"},null,null,{"$f":"MID(H190,8,6)","v":"MR.3.2"},null,null,{"$f":"MID(H190,15,6)","v":"MR.3.3"},null,null,{"$f":"MID(H190,22,6)","v":"MR.3.4"}]
[null,1,"Monitoraggio",null,null,null,null,null,null,null,null,null,null,"--",null,null,"--",null,null,"--",null,null,"--"]
[null,2,"Perlustrazione",null,null,null,null,null,null,null,null,null,null,"--",null,null,"--",null,null,"--",null,null,"--"]
[null,3,"Presidio Cancelli/Supporto Viabilità",null,null,null,null,null,null,null,null,null,null,"X",null,null,"--",null,null,"--",null,null,"--"]
[null,4,"Informazione Diretta alla Popolazione",null,null,null,null,null,null,null,null,null,null,"X",null,null,"--",null,null,"--",null,null,"--"]
[null,5,"Allestimento Area di Ricovero",null,null,null,null,null,null,null,null,null,null,"--",null,null,"--",null,null,"X",null,null,"--"]
[null,6,"Allestimento Area di Ammassamento Soccorsi",null,null,null,null,null,null,null,null,null,null,"--",null,null,"X",null,null,"--",null,null,"--"]
[null,7,"Evacuazione",null,null,null,null,null,null,null,null,null,null,"--",null,null,"--",null,null,"--",null,null,"X"]
[null,8,"Rimozione Ostacoli",null,null,null,null,null,null,null,null,null,null,"--",null,null,"--",null,null,"--",null,null,"--"]
[null,9,"Rimozione Ostacoli da Alveo",null,null,null,null,null,null,null,null,null,null,"--",null,null,"--",null,null,"--",null,null,"--"]
[null,10,"Preservazione Argini",null,null,null,null,null,null,null,null,null,null,"--",null,null,"--",null,null,"--",null,null,"--"]
[null,11,"Frana",null,null,null,null,null,null,null,null,null,null,"--",null,null,"--",null,null,"--",null,null,"--"]

{"sheet":"IN","index":12,"n_rows":112,"n_cols":27,"rows_kept":112,"cut":false,"hidden":false,"merged":[[16,1,19,9],[16,10,19,24],[20,1,21,9],[20,10,21,24],[22,1,24,9],[8,10,8,24],[81,23,81,24],[0,0,1,6],[0,7,1,18],[0,19,1,25],[3,0,4,22],[3,23,6,25],[5,0,6,22],[8,1,8,9],[10,1,15,9],[10,10,11,24],[12,10,15,24],[46,10,46,24],[47,1,49,9],[9,1,9,9],[9,10,9,24],[25,1,28,9],[25,10,28,24],[29,1,32,9],[90,23,90,25],[84,0,84,4],[84,5,84,10],[84,11,84,14],[84,15,84,18],[84,19,84,22],[84,23,84,25],[58,1,58,9],[58,10,58,24],[63,0,64,22],[63,23,66,25],[65,0,66,22],[69,0,70,4],[82,23,82,25],[80,0,83,4],[76,0,79,4],[85,0,89,4],[90,0,92,4],[90,5,92,10],[90,11,90,14],[90,15,92,18],[90,19,92,22],[91,11,91,14],[92,11,92,14],[29,10,32,24],[33,1,36,9],[33,10,36,24],[37,1,39,9],[37,10,37,24],[38,10,38,24],[39,10,39,24],[40,1,42,9],[40,10,40,24],[41,10,41,24],[42,10,42,24],[45,10,45,24],[43,1,46,9],[43,10,43,24],[44,10,44,24],[71,15,75,18],[71,19,75,22],[71,23,75,25],[69,5,70,10],[69,11,70,14],[69,15,70,18],[71,0,75,4],[71,5,75,10],[71,11,75,14],[69,23,70,25],[69,19,70,22],[47,10,49,24],[50,1,52,9],[50,11,50,24],[51,11,51,24],[52,11,52,24],[59,1,60,9],[59,10,59,24],[60,10,60,24],[53,1,57,9],[53,10,57,24],[100,23,101,25],[80,19,83,22],[76,15,79,18],[76,19,79,22],[91,23,91,25],[93,23,93,25],[97,23,97,24],[98,23,98,25],[80,5,83,10],[80,11,83,14],[76,5,79,10],[76,11,76,14],[76,23,79,25],[77,11,77,14],[78,11,78,14],[79,11,79,14],[85,5,89,10],[85,11,89,14],[85,15,89,18],[85,19,89,22],[85,23,89,25],[94,19,94,22],[95,19,95,22],[96,0,99,4],[96,5,99,10],[96,11,99,14],[96,15,99,18],[96,19,99,22],[93,0,95,4],[93,11,95,14],[93,15,95,18],[93,19,93,22],[102,5,103,10],[102,11,103,14],[102,15,103,18],[102,19,103,22],[100,0,101,4],[100,5,101,10],[100,11,101,14],[100,15,101,18],[100,19,101,22],[22,17,24,24],[111,0,111,25],[22,10,22,16],[23,10,23,16],[24,10,24,16],[107,23,107,25],[93,5,95,10],[107,0,108,4],[107,5,109,10],[107,11,109,14],[107,15,109,18],[107,19,107,22],[108,19,108,22],[109,0,109,4],[109,19,109,22],[102,23,103,25],[104,0,106,4],[104,5,106,10],[104,11,106,14],[104,15,106,18],[104,19,104,22],[105,19,105,22],[106,19,106,22],[102,0,103,4]]}
[{"$f":"NCOM&\" (\"&PCOM&\")\"","v":"Comune di Trescore Cremasco (CR)"},null,null,null,null,null,null,{"$f":"IF(INDEX(INT,1,13)=\"\",INDEX(INT,1,1),INDEX(INT,1,13))","v":"Piano di Emergenza Intercomunale di Protezione Civile"},null,null,null,null,null,null,null,null,null,null,null,{"$f":"IF(TIPOP=\"Edizione\",\"Ed. \",IF(TIPOP=\"Revisione\",\"Rev. \",\"Bozza \"))&TIPON&\" del \"&TIPOD","v":"Ed. 01 del 04/11/2012"}]
[]
[]
["Scheda Scenario",null,null,null,null,null,null,null,null,null,null,null,null,null,null,null,null,null,null,null,null,null,null,{"$f":"IN","v":"IN"}]
[]
[{"$f":"IF(INDEX(INPAR,1,19)=\"\",INDEX(INPAR,1,12),INDEX(INPAR,1,19))","v":"Grande Nevicata/Ghiaccio"}]
[]
[]
[null,"Paragrafi di Riferimento ",null,null,null,null,null,null,null,null,{"$f":"INDEX(INPAR,1,1)&INDEX(INPAR,1,12)","v":"2.2.2 - 3.3.2 Procedure per la rimozione Neve e Spargimento Sale"}]
[null,"Codice Scheda",null,null,null,null,null,null,null,null,{"$f":"X4","v":"IN"}]
[null,"Evento atteso",null,null,null,null,null,null,null,null,"Grande precipitazione nevosa o importante calo della temperatura che possa causare interruzioni e gravi disagi alla mobilità."]
[]
[null,null,null,null,null,null,null,null,null,null,"Questa procedura non sostituisce il Piano Neve Comunale, ma interviente solo in caso di nevicata eccezionale non fronteggiabile con i mezzi ordinari a disposizione dell'Amministrazione Comunale"]
[]
[]
[]
[null,"Attività U.C.L.",null,null,null,null,null,null,null,null,"Controlla che le imprese incaricate provvedano ad intervenire come da capitalato. Attiva il Servizio di Soccorso e/o il Servizio di Allerta in funzione della gravità delle precipitazioni."]
[]
[]
[]
[null,"Ubicazione intervento",null,null,null,null,null,null,null,null,"La tipologia dell'evento normalmente interessa la totalità del territorio."]
[]
[null,"Personale mobilitato",null,null,null,null,null,null,null,null,{"$f":"IF(INDEX(INPER,1,1)=\"\",\"\",\"- \"&VLOOKUP(INDEX(INPER,1,1),Personale,IF(INDEX(Personale,INDEX(INPER,1,1),14)=\"\",2,14)))","v":"- Polizia Locale"},null,null,null,null,null,null,"Riportare la composizione delle squadre nel Modulo M1"]
[null,null,null,null,null,null,null,null,null,null,{"$f":"IF(INDEX(INPER,1,2)=\"\",\"\",\"- \"&VLOOKUP(INDEX(INPER,1,2),Personale,IF(INDEX(Personale,INDEX(INPER,1,2),14)=\"\",2,14)))","v":"- Volontari P.C."}]
[null,null,null,null,null,null,null,null,null,null,{"$f":"IF(INDEX(INPER,1,3)=\"\",\"\",\"- \"&VLOOKUP(INDEX(INPER,1,3),Personale,IF(INDEX(Personale,INDEX(INPER,1,3),14)=\"\",2,14)))","v":""}]
[null,"Attività personale mobilitato",null,null,null,null,null,null,null,null,"Monitoraggio del territorio ed eventuali interventi di soccorso della popolazione isolata. "]
[]
[]
[]
[null,"Grado di coinvolgimento della popolazione",null,null,null,null,null,null,null,null,"Si provvede al soccorso della popolazione che eventualmente possa rimanere isolata nelle proprie case mediante rifornimenti di generi di prima necessità."]
[]
[]
[]
[null,"Cancelli e vie alternative",null,null,null,null,null,null,null,null,"Vengono posizionati dei cancelli finalizzati alla deviazione del traffico in direttrici più sicure per la circolazione."]
[]
[]
[]
[null,"Aree di raccolta popolazione",null,null,null,null,null,null,null,null,{"$f":"IF(INDEX(INRIC,1,1)=\"\",\"In questa fase non è prevista l’attivazione di tali aree.\",\"Per questa emergenza \"&IF(INDEX(INRIC,1,2)=\"\",\"è disponibile la seguente area:\",\"sono disponibili le seguenti aree:\"))","v":"In questa fase non è prevista l’attivazione di tali aree."}]
[null,null,null,null,null,null,null,null,null,null,{"$f":"IF(INDEX(INRIC,1,1)=\"\",\"\",\"- \"&VLOOKUP(INDEX(INRIC,1,1),Ricovero,2))","v":""}]
[null,null,null,null,null,null,null,null,null,null,{"$f":"IF(INDEX(INRIC,1,2)=\"\",\"\",\"- \"&VLOOKUP(INDEX(INRIC,1,2),Ricovero,2))","v":""}]
[null,"Area di ricovero",null,null,null,null,null,null,null,null,{"$f":"IF(INDEX(INRIC,1,3)=\"\",\"\",\"- \"&VLOOKUP(INDEX(INRIC,1,3),Ricovero,2))","v":""}]
[null,null,null,null,null,null,null,null,null,null,{"$f":"IF(INDEX(INRIC,1,4)=\"\",\"\",\"- \"&VLOOKUP(INDEX(INRIC,1,4),Ricovero,2))","v":""}]
[null,null,null,null,null,null,null,null,null,null,{"$f":"IF(K40=\"\",\"\",\"In funzione della gravità della situazione si decide quali/quante aree attivare.\")","v":""}]
[null,"Area di raduno soccorritori",null,null,null,null,null,null,null,null,{"$f":"IF(INDEX(INSOC,1,1)=\"\",\"In questa fase non è prevista l’attivazione di tali aree.\",\"Per questa emergenza \"&IF(INDEX(INSOC,1,2)=\"\",\"è disponibile la seguente area:\",\"sono disponibili le seguenti aree:\"))","v":"In questa fase non è prevista l’attivazione di tali aree."}]
[null,null,null,null,null,null,null,null,null,null,{"$f":"IF(INDEX(INSOC,1,1)=\"\",\"\",\"- \"&VLOOKUP(INDEX(INSOC,1,1),Soccorritori,2))","v":""}]
[null,null,null,null,null,null,null,null,null,null,{"$f":"IF(INDEX(INSOC,1,2)=\"\",\"\",\"- \"&VLOOKUP(INDEX(INSOC,1,2),Soccorritori,2))","v":""}]
[null,null,null,null,null,null,null,null,null,null,{"$f":"IF(K45=\"\",\"\",\"In funzione della gravità della situazione si decide quali/quante aree attivare.\")","v":""}]
[null,"Ordinanze Necessarie",null,null,null,null,null,null,null,null,"Non determinabili a priori."]
[]
[]
[null,"Modalita’ Riunione U.C.L.",null,null,null,null,null,null,null,null,"X","Non necessaria"]
[null,null,null,null,null,null,null,null,null,null,"X","Virtuale"]
[null,null,null,null,null,null,null,null,null,null,null,"In sede"]
[null,"Possibili Scenari Concomitanti",null,null,null,null,null,null,null,null,"Non ragionevolmente prevedibile la concomitanza con altri eventi."]
[]
[]
[]
[]
[null,"Contatti Utili",null,null,null,null,null,null,null,null,{"$f":"\"Consultare il \"&IF([1]Maschera!Z71=\"\",[1]Maschera!N71,[1]Maschera!Z71)","v":"Consultare il Tomo Giallo - Risorse"}]
[null,"Cartografia",null,null,null,null,null,null,null,null,{"$f":"INDEX(INPAR,1,28)","v":"Tav. 3/A - Rischio Idrogeologico"}]
[null,null,null,null,null,null,null,null,null,null,{"$f":"INDEX(INPAR,1,39)","v":"Tav. 3/D - Stradario Piano di Emergenza"}]
[]
[]
[{"$f":"Titolo2","v":"Procedure U.C.L."},null,null,null,null,null,null,null,null,null,null,null,null,null,null,null,null,null,null,null,null,null,null,{"$f":"X4","v":"IN"}]
[]
[{"$f":"$A$6","v":"Grande Nevicata/Ghiaccio"}]
[]
[]
[]
["RESPONSABILE",null,null,null,null,"AZIONE",null,null,null,null,null,"MEMBRO UCL",null,null,null,"OPERATIVI",null,null,null,"ENTE INTERESSATO",null,null,null,"SCHEDE CHIAMATE"]
[]
[{"$f":"IF(INDEX(RT,1,9)=\"\",INDEX(RT,1,1),INDEX(RT,1,9))","v":"RESP. TERRITORIO"},null,null,null,null,"Nel caso le precipitazioni nevose non siano gestibili con le normali attività previste in caso di neve allerta l'U.C.L.",null,null,null,null,null,"- Tutti",null,null,null,"--",null,null,null,"--",null,null,null,"O1 - O2"]
[]
[]
[]
[]
["SINDACO / R.O.C.",null,null,null,null,"Attiva il Volontariato e dispone l'utilizzo di Ditte con mezzi adatti presenti sul territorio comunale.",null,null,null,null,null,null,null,null,null,"--",null,null,null,"--",null,null,null,"O1 - O2"]
[null,null,null,null,null,null,null,null,null,null,null,{"$f":"\"- \"&PROPER(IF(INDEX(RT,1,9)=\"\",INDEX(RT,1,1),INDEX(RT,1,9)))","v":"- Resp. Territorio"}]
[null,null,null,null,null,null,null,null,null,null,null,{"$f":"\"- \"&PROPER(IF(INDEX(CV,1,9)=\"\",INDEX(CV,1,1),INDEX(CV,1,9)))","v":"- C. Volontariato"}]
[]
[{"$f":"IF(INDEX(RT,1,9)=\"\",INDEX(RT,1,1),INDEX(RT,1,9))","v":"RESP. TERRITORIO"},null,null,null,null,"Attiva Ditte con mezzi adatti presenti sul territorio comunale e coordina il Volontariato.",null,null,null,null,null,{"$f":"\"- \"&PROPER(IF(INDEX(CV,1,9)=\"\",INDEX(CV,1,1),INDEX(CV,1,9)))","v":"- C. Volontariato"},null,null,null,null,null,null,null,"--"]
[null,null,null,null,null,null,null,null,null,null,null,null,null,null,null,{"$f":"\"- \"&IF(INDEX(TCO,1,9)=\"\",INDEX(TCO,1,1),INDEX(TCO,1,9))","v":"- Tecnici Comunali"},null,null,null,null,null,null,null,"O1 - O2",null,"B4"]
[null,null,null,null,null,null,null,null,null,null,null,null,null,null,null,{"$f":"\"- \"&IF(INDEX(OP,1,9)=\"\",INDEX(OP,1,1),INDEX(OP,1,9))","v":"- Operai"},null,null,null,null,null,null,null,"A2.1 - A2.3"]
[]
[{"$f":"IF(INDEX(CV,1,9)=\"\",INDEX(CV,1,1),INDEX(CV,1,9))","v":"C. VOLONTARIATO"},null,null,null,null,"Organizza i volontari.",null,null,null,null,null,"--",null,null,null,{"$f":"\"- \"&IF(INDEX(VO,1,9)=\"\",INDEX(VO,1,1),INDEX(VO,1,9))","v":"- Gruppi Volontari"},null,null,null,"--",null,null,null,"A3 - B3"]
["C. VOLONTARIATO",null,null,null,null,"Provvede alla salatura delle strade. Se necessario attiva la fase di rimozione della neve e dispone il controllo della viabilità.",null,null,null,null,null,"--",null,null,null,{"$f":"\"- \"&IF(INDEX(VO,1,9)=\"\",INDEX(VO,1,1),INDEX(VO,1,9))","v":"- Gruppi Volontari"},null,null,null,"--",null,null,null,"A3 - B3"]
[]
[]
[null,null,null,null,null,null,null,null,null,null,null,null,null,null,null,null,null,null,null,null,null,null,null,null,null,null,{"$f":"_MRI3&\".4\"","v":"MR.3.4"}]
[]
["C. VOLONTARIATO",null,null,null,null,"Se la situazione evolve verso la normalità dispone il rientro dei volontari.",null,null,null,null,null,{"$f":"\"- \"&PROPER(IF(INDEX(PL,1,9)=\"\",INDEX(PL,1,1),INDEX(PL,1,9)))","v":"- Polizia Locale"},null,null,null,"- Gruppi Volontari",null,null,null,"--",null,null,null,"O1 - O2"]
[null,null,null,null,null,null,null,null,null,null,null,{"$f":"\"- \"&PROPER(IF(INDEX(RT,1,9)=\"\",INDEX(RT,1,1),INDEX(RT,1,9)))","v":"- Resp. Territorio"},null,null,null,null,null,null,null,null,null,null,null,"A3 - B3"]
[]
[{"$f":"IF(INDEX(Sindaco,1,9)=\"\",INDEX(Sindaco,1,1),INDEX(Sindaco,1,9))","v":"SINDACO / R.O.C."},null,null,null,null,"Nel caso la situazione si aggravi dichiara lo Stato di Emergenza.",null,null,null,null,null,"- Tutti",null,null,null,"--",null,null,null,{"$f":"\"- \"&IF(INDEX(PR,1,9)=\"\",INDEX(PR,1,1),INDEX(PR,1,9))","v":"- Prefettura"},null,null,null,"O1 - O2"]
[null,null,null,null,null,null,null,null,null,null,null,null,null,null,null,null,null,null,null,{"$f":"\"- \"&IF(INDEX(PRO,1,9)=\"\",INDEX(PRO,1,1),INDEX(PRO,1,9))","v":"- Provincia"},null,null,null,"C2.1","C2.3","C2.4"]
[null,null,null,null,null,null,null,null,null,null,null,null,null,null,null,null,null,null,null,{"$f":"\"- \"&IF(INDEX(REG,1,9)=\"\",INDEX(REG,1,1),INDEX(REG,1,9))","v":"- Regione"}]
[{"$f":"IF(INDEX(RT,1,9)=\"\",INDEX(RT,1,1),INDEX(RT,1,9))","v":"RESP. TERRITORIO"},null,null,null,null,"Nel caso vi siano abitazioni isolate o persone incapaci di muoversi si provvede a portare loro i rifornimenti necessari. ",null,null,null,null,null,{"$f":"\"- \"&PROPER(IF(INDEX(CV,1,9)=\"\",INDEX(CV,1,1),INDEX(CV,1,9)))","v":"- C. Volontariato"},null,null,null,{"$f":"\"- \"&IF(INDEX(TCO,1,9)=\"\",INDEX(TCO,1,1),INDEX(TCO,1,9))","v":"- Tecnici Comunali"},null,null,null,"--"]
[null,null,null,null,null,null,null,null,null,null,null,null,null,null,null,null,null,null,null,null,null,null,null,"O1 - O2",null,"B6"]
[null,null,null,null,null,null,null,null,null,null,null,null,null,null,null,null,null,null,null,null,null,null,null,"A2.1 - A2.3"]
[]
[{"$f":"IF(INDEX(CV,1,9)=\"\",INDEX(CV,1,1),INDEX(CV,1,9))","v":"C. VOLONTARIATO"},null,null,null,null,"Responsabile dell'attività di rifornimento.",null,null,null,null,null,"--",null,null,null,{"$f":"\"- \"&IF(INDEX(VO,1,9)=\"\",INDEX(VO,1,1),INDEX(VO,1,9))","v":"- Gruppi Volontari"},null,null,null,"--",null,null,null,"A3 - B3"]
[]
[{"$f":"IF(INDEX(RSS,1,9)=\"\",INDEX(RSS,1,1),INDEX(RSS,1,9))","v":"RESP. SERV. SOCIALI"},null,null,null,null,"Coadiuva per quanto riguarda persone diversamente abili",null,null,null,null,null,"--",null,null,null,{"$f":"\"- \"&IF(INDEX(SO,1,9)=\"\",INDEX(SO,1,1),INDEX(SO,1,9))","v":"- Pers. Sanitario"},null,null,null,"--",null,null,null,"B1 - C2.2 - D1"]
[]
[{"$f":"IF(INDEX(Sindaco,1,9)=\"\",INDEX(Sindaco,1,1),INDEX(Sindaco,1,9))","v":"SINDACO / R.O.C."},null,null,null,null,"Informa periodicamente gli enti sovraordinati e i media su quanto fatto.",null,null,null,null,null,"--",null,null,null,"--",null,null,null,{"$f":"\"- \"&IF(INDEX(PR,1,9)=\"\",INDEX(PR,1,1),INDEX(PR,1,9))","v":"- Prefettura"}]
[null,null,null,null,null,null,null,null,null,null,null,null,null,null,null,null,null,null,null,{"$f":"\"- \"&IF(INDEX(PRO,1,9)=\"\",INDEX(PRO,1,1),INDEX(PRO,1,9))","v":"- Provincia"},null,null,null,"C2.1","C2.3","C2.4"]
[null,null,null,null,null,null,null,null,null,null,null,null,null,null,null,null,null,null,null,{"$f":"\"- \"&IF(INDEX(REG,1,9)=\"\",INDEX(REG,1,1),INDEX(REG,1,9))","v":"- Regione"}]
[{"$f":"IF(INDEX(Sindaco,1,9)=\"\",INDEX(Sindaco,1,1),INDEX(Sindaco,1,9))","v":"SINDACO / R.O.C."},null,null,null,null,"Informa sulla revoca dello Stato di Emergenza. ",null,null,null,null,null,"- Tutti",null,null,null,{"$f":"\"- \"&IF(INDEX(SC,1,9)=\"\",INDEX(SC,1,1),INDEX(SC,1,9))","v":"- Squadre Operativi"},null,null,null,{"$f":"\"- \"&IF(INDEX(PR,1,9)=\"\",INDEX(PR,1,1),INDEX(PR,1,9))","v":"- Prefettura"},null,null,null,"O1 - O2"]
[null,null,null,null,null,null,null,null,null,null,null,null,null,null,null,null,null,null,null,{"$f":"\"- \"&IF(INDEX(PRO,1,9)=\"\",INDEX(PRO,1,1),INDEX(PRO,1,9))","v":"- Provincia"},null,null,null,"C2.1","C2.3","C2.4"]
["MEMBRI U.C.L",null,null,null,null,null,null,null,null,null,null,null,null,null,null,null,null,null,null,{"$f":"\"- \"&IF(INDEX(REG,1,9)=\"\",INDEX(REG,1,1),INDEX(REG,1,9))","v":"- Regione"},null,null,null,null,"M1"]
[]
["PER LE COMUNICAZIONI EVIDENZIATE IN ROSSO UTILIZZARE IL MODULO FAX M4"]

{"sheet":"IV_3","index":13,"n_rows":225,"n_cols":27,"rows_kept":225,"cut":false,"hidden":false,"merged":[[15,1,16,9],[15,10,16,24],[17,1,17,9],[17,10,17,24],[18,1,20,9],[8,10,8,24],[9,1,9,9],[9,10,9,24],[0,0,1,6],[0,7,1,18],[0,19,1,25],[3,0,4,22],[3,23,6,25],[5,0,6,22],[8,1,8,9],[10,1,14,9],[10,10,14,24],[18,17,20,24],[18,10,18,16],[19,10,19,16],[20,10,20,16],[21,1,23,9],[21,10,23,24],[24,1,28,9],[24,10,28,24],[29,1,34,9],[29,10,34,24],[35,1,37,9],[35,10,35,24],[36,10,36,24],[37,10,37,24],[38,1,40,9],[38,10,38,24],[39,10,39,24],[40,10,40,24],[41,1,44,9],[41,10,41,24],[42,10,42,24],[43,10,43,24],[44,10,44,24],[45,1,47,9],[45,10,47,24],[48,1,50,9],[48,11,48,24],[49,11,49,24],[50,11,50,24],[57,1,58,9],[51,1,55,9],[51,10,55,24],[56,1,56,9],[56,10,56,24],[57,10,57,24],[58,10,58,24],[131,26,136,26],[132,11,132,14],[133,11,133,14],[134,15,134,18],[136,0,136,4],[136,19,136,22],[136,23,136,25],[123,0,124,22],[123,23,126,25],[125,0,126,22],[128,0,130,4],[128,5,130,10],[128,11,128,25],[129,11,130,14],[129,15,130,18],[129,19,130,22],[129,23,130,25],[140,0,140,25],[131,0,133,4],[131,5,133,10],[131,11,131,14],[131,15,133,18],[131,19,133,22],[131,23,133,25],[136,5,136,10],[136,11,136,14],[136,15,136,18],[137,0,139,4],[137,5,139,10],[137,11,139,14],[137,15,139,18],[137,19,137,22],[137,23,139,25],[138,19,138,22],[139,19,139,22],[134,0,135,4],[134,5,135,10],[134,11,135,14],[135,15,135,18],[134,19,135,22],[134,23,135,25],[144,0,145,4],[144,5,145,10],[144,11,145,14],[144,15,145,18],[144,19,145,22],[144,23,145,25],[141,0,143,4],[141,5,143,10],[141,11,143,14],[141,15,143,18],[141,19,143,22],[141,23,143,25],[146,0,146,25],[147,0,150,4],[147,5,150,10],[147,11,147,14],[147,15,150,18],[147,19,150,22],[148,11,148,14],[149,11,149,14],[150,11,150,14],[148,23,148,25],[189,1,189,9],[189,10,189,24],[190,1,190,9],[190,10,190,24],[155,0,158,4],[155,5,158,10],[155,11,158,14],[155,15,158,18],[155,19,155,22],[155,23,158,25],[156,19,156,22],[157,19,157,22],[183,0,184,22],[183,23,186,25],[185,0,186,22],[188,1,188,9],[188,10,188,24],[158,19,158,22],[151,0,152,4],[151,5,152,10],[151,11,152,14],[151,19,152,22],[151,23,152,25],[153,0,154,4],[153,5,154,10],[153,11,154,14],[153,15,154,18],[153,19,154,22],[153,23,154,25],[151,15,151,18],[152,15,152,18],[214,3,214,14],[191,1,193,9],[191,10,191,24],[192,10,192,24],[193,10,193,24],[194,1,196,9],[194,10,194,24],[195,10,195,24],[196,10,196,24],[201,1,204,9],[201,10,204,24],[212,2,213,14],[212,15,212,23],[213,15,213,23],[205,1,207,9],[205,10,207,24],[197,1,200,9],[197,10,197,24],[198,10,198,24],[199,10,199,24],[200,10,200,24],[63,0,64,22],[63,23,66,25],[65,0,66,22],[224,15,224,23],[223,15,223,23],[220,15,220,23],[221,15,221,23],[222,15,222,23],[220,3,220,14],[221,3,221,14],[222,3,222,14],[223,3,223,14],[224,3,224,14],[215,15,215,23],[216,15,216,23],[217,15,217,23],[218,15,218,23],[219,15,219,23],[215,3,215,14],[216,3,216,14],[217,3,217,14],[218,3,218,14],[219,3,219,14],[214,15,214,23]]}
[{"$f":"NCOM&\" (\"&PCOM&\")\"","v":"Comune di Trescore Cremasco (CR)"},null,null,null,null,null,null,{"$f":"IF(INDEX(INT,1,13)=\"\",INDEX(INT,1,1),INDEX(INT,1,13))","v":"Piano di Emergenza Intercomunale di Protezione Civile"},null,null,null,null,null,null,null,null,null,null,null,{"$f":"IF(TIPOP=\"Edizione\",\"Ed. \",IF(TIPOP=\"Revisione\",\"Rev. \",\"Bozza \"))&TIPON&\" del \"&TIPOD","v":"Ed. 01 del 04/11/2012"}]
[]
[]
["Scheda Scenario",null,null,null,null,null,null,null,null,null,null,null,null,null,null,null,null,null,null,null,null,null,null,{"$f":"IV","v":"IV.3"}]
[]
[{"$f":"IF(INDEX(IVPAR,1,19)=\"\",INDEX(IVPAR,1,12),INDEX(IVPAR,1,19))&\" - Fase di Emergenza\"","v":"Rischio Interruzione Viabilità - Fase di Emergenza"}]
[]
[]
[null,"Paragrafi di Riferimento ",null,null,null,null,null,null,null,null,{"$f":"INDEX(IVPAR,1,1)&INDEX(IVPAR,1,12)","v":"2.2.8.2 - 3.3.8 Procedure per il Rischio Interruzione Viabilità"}]
[null,"Codice Scheda",null,null,null,null,null,null,null,null,{"$f":"X4","v":"IV.3"}]
[null,"Evento atteso",null,null,null,null,null,null,null,null,"Interruzione della viabilità in un punto critico per il traffico con conseguente blocco della circolazione."]
[]
[]
[]
[]
[null,"Attività U.C.L.",null,null,null,null,null,null,null,null,"Supporta il Comandante della Polizia Locale nella gestione del traffico veicolare."]
[]
[null,"Ubicazione intervento",null,null,null,null,null,null,null,null,"Tratti critici della viabilità."]
[null,"Personale mobilitato",null,null,null,null,null,null,null,null,{"$f":"IF(INDEX(IVPER,1,1)=\"\",\"\",\"- \"&VLOOKUP(INDEX(IVPER,1,1),Personale,IF(INDEX(Personale,INDEX(IVPER,1,1),14)=\"\",2,14)))","v":"- Polizia Locale"},null,null,null,null,null,null,"Riportare la composizione delle squadre nel Modulo M1"]
[null,null,null,null,null,null,null,null,null,null,{"$f":"IF(INDEX(IVPER,1,2)=\"\",\"\",\"- \"&VLOOKUP(INDEX(IVPER,1,2),Personale,IF(INDEX(Personale,INDEX(IVPER,1,2),14)=\"\",2,14)))","v":"- Volontari P.C."}]
[null,null,null,null,null,null,null,null,null,null,{"$f":"IF(INDEX(IVPER,1,3)=\"\",\"\",\"- \"&VLOOKUP(INDEX(IVPER,1,3),Personale,IF(INDEX(Personale,INDEX(IVPER,1,3),14)=\"\",2,14)))","v":""}]
[null,"Attività personale mobilitato",null,null,null,null,null,null,null,null,"Controllo del traffico e creazione di corridoi per lo smaltimento dello stesso evitando il più possibile ingorghi prolungati."]
[]
[]
[null,"Grado di coinvolgimento della popolazione",null,null,null,null,null,null,null,null,"Possibilità di rimanere bloccati nel traffico per periodi prolungati. Si forniscono informazioni ed eventuale assistenza agli automobilisti coinvolti."]
[]
[]
[]
[]
[null,"Cancelli e vie alternative",null,null,null,null,null,null,null,null,"E' prevista la creazione di corridoi a direzione obbligatoria per il traffico veicolare, finalizzati allo smaltimento del traffico."]
[]
[]
[]
[]
[]
[null,"Aree di raccolta popolazione",null,null,null,null,null,null,null,null,{"$f":"IF(INDEX(IVRIC,1,1)=\"\",\"In questa fase non è prevista l’attivazione di tali aree.\",\"Per questa emergenza \"&IF(INDEX(IVRIC,1,2)=\"\",\"è disponibile la seguente area:\",\"sono disponibili le seguenti aree:\"))","v":"In questa fase non è prevista l’attivazione di tali aree."}]
[null,null,null,null,null,null,null,null,null,null,{"$f":"IF(INDEX(IVRIC,1,1)=\"\",\"\",\"- \"&VLOOKUP(INDEX(IVRIC,1,1),Ricovero,2))","v":""}]
[null,null,null,null,null,null,null,null,null,null,{"$f":"IF(INDEX(IVRIC,1,2)=\"\",\"\",\"- \"&VLOOKUP(INDEX(IVRIC,1,2),Ricovero,2))","v":""}]
[null,"Area di ricovero",null,null,null,null,null,null,null,null,{"$f":"IF(INDEX(IVRIC,1,3)=\"\",\"\",\"- \"&VLOOKUP(INDEX(IVRIC,1,3),Ricovero,2))","v":""}]
[null,null,null,null,null,null,null,null,null,null,{"$f":"IF(INDEX(IVRIC,1,4)=\"\",\"\",\"- \"&VLOOKUP(INDEX(IVRIC,1,4),Ricovero,2))","v":""}]
[null,null,null,null,null,null,null,null,null,null,{"$f":"IF(K38=\"\",\"\",\"In funzione della gravità della situazione si decide quali/quante aree attivare.\")","v":""}]
[null,"Area di raduno soccorritori",null,null,null,null,null,null,null,null,{"$f":"IF(INDEX(IVSOC,1,1)=\"\",\"In questa fase non è prevista l’attivazione di tali aree.\",\"Per questa emergenza \"&IF(INDEX(IVSOC,1,2)=\"\",\"è disponibile la seguente area:\",\"sono disponibili le seguenti aree:\"))","v":"In questa fase non è prevista l’attivazione di tali aree."}]
[null,null,null,null,null,null,null,null,null,null,{"$f":"IF(INDEX(IVSOC,1,1)=\"\",\"\",\"- \"&VLOOKUP(INDEX(IVSOC,1,1),Ricovero,2))","v":""}]
[null,null,null,null,null,null,null,null,null,null,{"$f":"IF(INDEX(IVSOC,1,2)=\"\",\"\",\"- \"&VLOOKUP(INDEX(IVSOC,1,2),Ricovero,2))","v":""}]
[null,null,null,null,null,null,null,null,null,null,{"$f":"IF(K43=\"\",\"\",\"In funzione della gravità della situazione si decide quali/quante aree attivare.\")","v":""}]
[null,"Ordinanze Necessarie",null,null,null,null,null,null,null,null,"Chiusura Strade."]
[]
[]
[null,"Modalita’ Riunione U.C.L.",null,null,null,null,null,null,null,null,null,"Non necessaria"]
[null,null,null,null,null,null,null,null,null,null,"X","Virtuale"]
[null,null,null,null,null,null,null,null,null,null,null,"In sede"]
[null,"Possibili Scenari Concomitanti",null,null,null,null,null,null,null,null,"Non ragionevolmente prevedibile la concomitanza con altri eventi."]
[]
[]
[]
[]
[null,"Contatti Utili",null,null,null,null,null,null,null,null,{"$f":"\"Consultare il \"&IF([1]Maschera!Z71=\"\",[1]Maschera!N71,[1]Maschera!Z71)","v":"Consultare il Tomo Giallo - Risorse"}]
[null,"Cartografia",null,null,null,null,null,null,null,null,{"$f":"INDEX(IVPAR,1,28)","v":"Tav. 3/C - Rischio Viabilità - AIB - Altri Rischi"}]
[null,null,null,null,null,null,null,null,null,null,{"$f":"INDEX(IVPAR,1,39)","v":"Tav. 3/D - Stradario Piano di Emergenza"}]
[]
[]
[]
[]
[{"$f":"Titolo2","v":"Procedure U.C.L."},null,null,null,null,null,null,null,null,null,null,null,null,null,null,null,null,null,null,null,null,null,null,{"$f":"IV","v":"IV.3"}]
[]
[{"$f":"$A$6","v":"Rischio Interruzione Viabilità - Fase di Emergenza"}]
[]
[]
[]
[]
[]
[]
[]
[]
[]
[]
[]
[]
[]
[]
[]
[]
[]
[]
[]
[]
[]
[]
[]
[]
[]
[]
[]
[]
[]
[]
[]
[]
[]
[]
[]
[]
[]
[]
[]
[]
[]
[]
[]
[]
[]
[]
[]
[]
[]
[]
[]
[]
[]
[]
[]
[]
[]
[{"$f":"Titolo2","v":"Procedure U.C.L."},null,null,null,null,null,null,null,null,null,null,null,null,null,null,null,null,null,null,null,null,null,null,{"$f":"X4","v":"IV.3"}]
[]
[{"$f":"$A$6","v":"Rischio Interruzione Viabilità - Fase di Emergenza"}]
[]
[]
["RESPONSABILE",null,null,null,null,"AZIONE",null,null,null,null,null,"CHIAMATE"]
[null,null,null,null,null,null,null,null,null,null,null,"MEMBRO UCL",null,null,null,"OPERATIVI",null,null,null,"ENTE INTERESSATO",null,null,null,"SCHEDE CHIAMATE"]
[]
["POLIZIA LOCALE",null,null,null,null,{"$f":"\"Constatata una situazione di traffico difficile attiva la procedura \"&IV&\".1\"","v":"Constatata una situazione di traffico difficile attiva la procedura IV.3.1"},null,null,null,null,null,"- Sindaco",null,null,null,{"$f":"\"- \"&IF(INDEX(PLO,1,9)=\"\",INDEX(PLO,1,1),INDEX(PLO,1,9))","v":"- Agenti P.L."},null,null,null,"--",null,null,null,"O1 - O2  A2.2",null,null,{"$f":"IV&\".1\"","v":"IV.3.1"}]
[null,null,null,null,null,null,null,null,null,null,null,{"$f":"\"- \"&PROPER(IF(INDEX(ROC,1,9)=\"\",INDEX(ROC,1,1),INDEX(ROC,1,9)))","v":"- R.O.C."}]
[null,null,null,null,null,null,null,null,null,null,null,{"$f":"\"- \"&PROPER(IF(INDEX(RT,1,9)=\"\",INDEX(RT,1,1),INDEX(RT,1,9)))","v":"- Resp. Territorio"}]
[{"$f":"IF(INDEX(RT,1,9)=\"\",INDEX(RT,1,1),INDEX(RT,1,9))","v":"RESP. TERRITORIO"},null,null,null,null,{"$f":"\"Coadiuva \"&IV&\".1\"","v":"Coadiuva IV.3.1"},null,null,null,null,null,"--",null,null,null,{"$f":"\"- \"&IF(INDEX(TCO,1,9)=\"\",INDEX(TCO,1,1),INDEX(TCO,1,9))","v":"- Tecnici Comunali"},null,null,null,"--",null,null,null,"A2.1   A2.3"]
[null,null,null,null,null,null,null,null,null,null,null,null,null,null,null,{"$f":"\"- \"&IF(INDEX(OP,1,9)=\"\",INDEX(OP,1,1),INDEX(OP,1,9))","v":"- Operai"}]
[{"$f":"IF(INDEX(CV,1,9)=\"\",INDEX(CV,1,1),INDEX(CV,1,9))","v":"C. VOLONTARIATO"},null,null,null,null,{"$f":"\"Coadiuva \"&IV&\".1\"","v":"Coadiuva IV.3.1"},null,null,null,null,null,"--",null,null,null,{"$f":"\"- \"&IF(INDEX(VO,1,9)=\"\",INDEX(VO,1,1),INDEX(VO,1,9))","v":"- Gruppi Volontari"},null,null,null,"--",null,null,null,"A3 - B3"]
[{"$f":"IF(INDEX(Sindaco,1,9)=\"\",INDEX(Sindaco,1,1),INDEX(Sindaco,1,9))","v":"SINDACO / R.O.C."},null,null,null,null,"Avvisa i gestori delle strade sovracomunali, i comuni limitrofi e i media.",null,null,null,null,null,"--",null,null,null,"--",null,null,null,{"$f":"\"- \"&IF(INDEX(AN,1,9)=\"\",INDEX(AN,1,1),INDEX(AN,1,9))","v":"- ANAS"},null,null,null,"C2.1"]
[null,null,null,null,null,null,null,null,null,null,null,null,null,null,null,null,null,null,null,{"$f":"\"- \"&IF(INDEX(PRO,1,9)=\"\",INDEX(PRO,1,1),INDEX(PRO,1,9))","v":"- Provincia"}]
[null,null,null,null,null,null,null,null,null,null,null,null,null,null,null,null,null,null,null,{"$f":"\"- \"&IF(INDEX(CL,1,9)=\"\",INDEX(CL,1,1),INDEX(CL,1,9))","v":"- Comuni Limitrofi"}]
["NEL CASO SIA NECESSARIA ASSISTENZA AGLI AUTOMOBILISTI IN CODA"]
["POLIZIA LOCALE",null,null,null,null,"Richiede l'invio dei volontari a supporto degli automobilisti.",null,null,null,null,null,{"$f":"\"- \"&PROPER(IF(INDEX(CV,1,9)=\"\",INDEX(CV,1,1),INDEX(CV,1,9)))","v":"- C. Volontariato"},null,null,null,"--",null,null,null,"--",null,null,null,"O1 - O2"]
[]
[]
["C. VOLONTARIATO",null,null,null,null,"Provvede all'assistenza agli automobilisti.",null,null,null,null,null,"--",null,null,null,{"$f":"\"- \"&IF(INDEX(VO,1,9)=\"\",INDEX(VO,1,1),INDEX(VO,1,9))","v":"- Gruppi Volontari"},null,null,null,"--",null,null,null,"A3 - B3"]
[]
["SE LA SITUAZIONE DEL TRAFFICO SI NORMALIZZA"]
["POLIZIA LOCALE",null,null,null,null,"Avvisa della normalizzazione dell'emergenza e dispone il rientro degli operativi.",null,null,null,null,null,"- Sindaco",null,null,null,{"$f":"\"- \"&IF(INDEX(PLO,1,9)=\"\",INDEX(PLO,1,1),INDEX(PLO,1,9))","v":"- Agenti P.L."},null,null,null,"--"]
[null,null,null,null,null,null,null,null,null,null,null,{"$f":"\"- \"&PROPER(IF(INDEX(ROC,1,9)=\"\",INDEX(ROC,1,1),INDEX(ROC,1,9)))","v":"- R.O.C."},null,null,null,null,null,null,null,null,null,null,null,"O1 - O2  A2.2"]
[null,null,null,null,null,null,null,null,null,null,null,{"$f":"\"- \"&PROPER(IF(INDEX(RT,1,9)=\"\",INDEX(RT,1,1),INDEX(RT,1,9)))","v":"- Resp. Territorio"},null,null,null,null,null,null,null,null,null,null,null,null,"M1"]
[null,null,null,null,null,null,null,null,null,null,null,{"$f":"\"- \"&PROPER(IF(INDEX(CV,1,9)=\"\",INDEX(CV,1,1),INDEX(CV,1,9)))","v":"- C. Volontariato"}]
[{"$f":"IF(INDEX(RT,1,9)=\"\",INDEX(RT,1,1),INDEX(RT,1,9))","v":"RESP. TERRITORIO"},null,null,null,null,"Dispone il rientro degli operativi",null,null,null,null,null,"--",null,null,null,{"$f":"\"- \"&IF(INDEX(TCO,1,9)=\"\",INDEX(TCO,1,1),INDEX(TCO,1,9))","v":"- Tecnici Comunali"},null,null,null,"--",null,null,null,"A2.1   A2.3"]
[null,null,null,null,null,null,null,null,null,null,null,null,null,null,null,{"$f":"\"- \"&IF(INDEX(OP,1,9)=\"\",INDEX(OP,1,1),INDEX(OP,1,9))","v":"- Operai"}]
["C. VOLONTARIATO",null,null,null,null,"Dispone il rientro degli operativi",null,null,null,null,null,"--",null,null,null,{"$f":"\"- \"&IF(INDEX(VO,1,9)=\"\",INDEX(VO,1,1),INDEX(VO,1,9))","v":"- Gruppi Volontari"},null,null,null,"--",null,null,null,"A3 - B3"]
[]
[{"$f":"IF(INDEX(Sindaco,1,9)=\"\",INDEX(Sindaco,1,1),INDEX(Sindaco,1,9))","v":"SINDACO / R.O.C."},null,null,null,null,"Avvisa i gestori delle strade sovracomunali, i comuni limitrofi e i media della cessata emergenza",null,null,null,null,null,"--",null,null,null,"--",null,null,null,{"$f":"\"- \"&IF(INDEX(AN,1,9)=\"\",INDEX(AN,1,1),INDEX(AN,1,9))","v":"- ANAS"},null,null,null,"C2.1"]
[null,null,null,null,null,null,null,null,null,null,null,null,null,null,null,null,null,null,null,{"$f":"\"- \"&IF(INDEX(PRO,1,9)=\"\",INDEX(PRO,1,1),INDEX(PRO,1,9))","v":"- Provincia"}]
[null,null,null,null,null,null,null,null,null,null,null,null,null,null,null,null,null,null,null,{"$f":"\"- \"&IF(INDEX(CL,1,9)=\"\",INDEX(CL,1,1),INDEX(CL,1,9))","v":"- Comuni Limitrofi"}]
[]
[]
[]
[]
[]
[]
[]
[]
[]
[]
[]
[]
[]
[]
[]
[]
[]
[]
[]
[]
[]
[]
[]
[]
[]
[{"$f":"Titolo3","v":"Scheda Procedura Operativa"},null,null,null,null,null,null,null,null,null,null,null,null,null,null,null,null,null,null,null,null,null,null,{"$f":"X4","v":"IV.3"}]
[]
[{"$f":"$A$6","v":"Rischio Interruzione Viabilità - Fase di Emergenza"}]
[]
[]
[null,"Codice Scheda Scenario",null,null,null,null,null,null,null,null,{"$f":"X4","v":"IV.3"}]
[null,"Tipo di Procedure",null,null,null,null,null,null,null,null,{"$f":"IV&\".1 - AZIONI DI SALVAGUARDIA\"","v":"IV.3.1 - AZIONI DI SALVAGUARDIA"}]
[null,"Ubicazione intervento",null,null,null,null,null,null,null,null,{"$f":"K18","v":"Tratti critici della viabilità."}]
[null,"Aree di raccolta popolazione",null,null,null,null,null,null,null,null,{"$f":"K36","v":"In questa fase non è prevista l’attivazione di tali aree."}]
[null,null,null,null,null,null,null,null,null,null,""]
[null,null,null,null,null,null,null,null,null,null,""]
[null,"Area di ricovero",null,null,null,null,null,null,null,null,""]
[null,null,null,null,null,null,null,null,null,null,""]
[null,null,null,null,null,null,null,null,null,null,""]
[null,"Area di raduno soccorritori",null,null,null,null,null,null,null,null,"In questa fase non è prevista l’attivazione di tali aree."]
[null,null,null,null,null,null,null,null,null,null,""]
[null,null,null,null,null,null,null,null,null,null,""]
[null,null,null,null,null,null,null,null,null,null,""]
[null,"Cancelli e vie alternative",null,null,null,null,null,null,null,null,"Il posizionamento dei cancelli viene deciso in base alla localizzazione della causa dei rallentamenti, aiutandosi con gli scenari previsti dal Piano di Emergenza Comunale."]
[]
[]
[]
[null,"Contatti Utili",null,null,null,null,null,null,null,null,"Si faccia riferimento al PRONTUARIO DI EMERGENZA - CONTATTI"]
[]
[]
[]
[]
[]
[]
[null,null,"Procedura Operativa Standard (POS)",null,null,null,null,null,null,null,null,null,null,null,null,"Procedure Previste"]
[null,null,null,null,null,null,null,null,null,null,null,null,null,null,null,{"$f":"K190","v":"IV.3.1 - AZIONI DI SALVAGUARDIA"}]
[null,null,1,"Monitoraggio",null,null,null,null,null,null,null,null,null,null,null,"--"]
[null,null,2,"Perlustrazione",null,null,null,null,null,null,null,null,null,null,null,"--"]
[null,null,3,"Presidio Cancelli/Supporto Viabilità",null,null,null,null,null,null,null,null,null,null,null,"X"]
[null,null,4,"Informazione Diretta alla Popolazione",null,null,null,null,null,null,null,null,null,null,null,"X"]
[null,null,5,"Allestimento Area di Ricovero",null,null,null,null,null,null,null,null,null,null,null,"--"]
[null,null,6,"Allestimento Area di Ammassamento Soccorsi",null,null,null,null,null,null,null,null,null,null,null,"--"]
[null,null,7,"Evacuazione",null,null,null,null,null,null,null,null,null,null,null,"--"]
[null,null,8,"Rimozione Ostacoli",null,null,null,null,null,null,null,null,null,null,null,"--"]
[null,null,9,"Rimozione Ostacoli da Alveo",null,null,null,null,null,null,null,null,null,null,null,"--"]
[null,null,10,"Preservazione Argini",null,null,null,null,null,null,null,null,null,null,null,"--"]
[null,null,11,"Frana",null,null,null,null,null,null,null,null,null,null,null,"--"]

{"sheet":"POS","index":14,"n_rows":360,"n_cols":21,"rows_kept":360,"cut":false,"hidden":false,"merged":[[357,1,357,9],[357,10,357,25],[358,1,358,9],[358,10,358,25],[359,1,359,9],[359,10,359,25],[349,1,349,9],[349,10,349,25],[350,1,356,9],[350,10,350,25],[351,10,351,25],[352,10,353,25],[354,10,354,25],[355,10,356,25],[343,1,343,9],[343,10,343,25],[344,1,344,9],[344,10,344,25],[345,1,348,9],[345,10,345,25],[346,10,346,25],[347,10,348,25],[336,1,337,3],[336,4,337,6],[336,7,337,25],[338,1,340,9],[338,10,340,25],[341,1,342,9],[341,10,341,25],[342,10,342,25],[329,10,330,25],[331,1,331,9],[331,10,331,25],[332,1,332,9],[332,10,332,25],[333,1,333,9],[333,10,333,25],[317,1,319,9],[317,10,319,25],[320,1,320,9],[320,10,320,25],[321,1,330,9],[321,10,321,25],[322,10,322,25],[323,10,324,25],[325,10,326,25],[327,10,328,25],[314,1,314,9],[314,10,314,25],[315,1,315,9],[315,10,315,25],[316,1,316,9],[316,10,316,25],[308,1,309,3],[308,4,309,6],[308,7,309,25],[310,1,310,9],[310,10,310,25],[311,1,313,9],[311,10,311,25],[312,10,312,25],[313,10,313,25],[299,1,299,9],[299,10,299,25],[300,1,300,9],[300,10,300,25],[301,1,301,9],[301,10,301,25],[293,1,293,9],[293,10,293,25],[294,1,298,9],[294,10,294,25],[295,10,296,25],[297,10,298,25],[286,1,286,9],[286,10,286,25],[287,1,287,9],[287,10,287,25],[288,1,292,9],[288,10,289,25],[290,10,290,25],[291,10,291,25],[292,10,292,25],[278,1,283,9],[278,10,281,25],[282,10,283,25],[284,1,285,9],[284,10,284,25],[285,10,285,25],[270,1,270,9],[270,10,270,25],[271,1,271,9],[271,10,271,25],[276,1,277,3],[276,4,277,6],[276,7,277,25],[264,1,268,9],[264,10,264,25],[265,10,266,25],[267,10,268,25],[269,1,269,9],[269,10,269,25],[259,1,262,9],[259,10,259,25],[260,10,260,25],[261,10,261,25],[262,10,262,25],[263,1,263,9],[263,10,263,25],[255,1,256,9],[255,10,255,25],[256,10,256,25],[257,1,257,9],[257,10,257,25],[258,1,258,9],[258,10,258,25],[248,1,249,3],[248,4,249,6],[248,7,249,25],[250,1,254,9],[250,10,252,25],[253,10,254,25],[215,1,215,9],[215,10,215,25],[216,1,216,9],[216,10,216,25],[217,1,217,9],[217,10,217,25],[204,1,204,9],[204,10,204,25],[205,1,214,9],[205,10,206,25],[207,10,207,25],[208,10,208,25],[209,10,212,25],[213,10,213,25],[214,10,214,25],[198,1,199,9],[198,10,199,25],[200,1,200,9],[200,10,200,25],[201,1,203,9],[201,10,201,25],[202,10,202,25],[203,10,203,25],[191,1,192,3],[191,4,192,6],[191,7,192,25],[193,1,194,9],[193,10,194,25],[195,1,197,9],[195,10,195,25],[196,10,196,25],[197,10,197,25],[170,1,170,9],[170,10,170,25],[171,1,171,9],[171,10,171,25],[172,1,172,9],[172,10,172,25],[165,1,165,9],[165,10,165,25],[166,1,166,9],[166,10,166,25],[167,1,169,9],[167,10,167,25],[168,10,168,25],[169,10,169,25],[162,1,162,9],[162,10,162,25],[163,1,163,9],[163,10,163,25],[164,1,164,9],[164,10,164,25],[154,1,155,3],[154,4,155,6],[154,7,155,25],[156,1,158,9],[156,10,158,25],[159,1,161,9],[159,10,159,25],[160,10,160,25],[161,10,161,25],[146,10,146,25],[147,1,147,9],[147,10,147,25],[148,1,148,9],[148,10,148,25],[149,1,149,9],[149,10,149,25],[139,1,139,9],[139,10,139,25],[140,1,140,9],[140,10,140,25],[141,1,146,9],[141,10,141,25],[142,10,142,25],[143,10,143,25],[144,10,144,25],[145,10,145,25],[136,1,136,9],[136,10,136,25],[137,1,137,9],[137,10,137,25],[138,1,138,9],[138,10,138,25],[130,1,132,9],[130,10,132,25],[133,1,135,9],[133,10,133,25],[134,10,134,25],[135,10,135,25],[110,1,110,9],[110,10,110,25],[111,1,111,9],[111,10,111,25],[128,1,129,3],[128,4,129,6],[128,7,129,25],[107,1,107,9],[107,10,107,25],[108,1,108,9],[108,10,108,25],[109,1,109,9],[109,10,109,25],[102,1,102,9],[102,10,102,25],[103,1,103,9],[103,10,103,25],[104,1,106,9],[104,10,104,25],[105,10,105,25],[106,10,106,25],[96,1,99,9],[96,10,96,25],[97,10,97,25],[98,10,98,25],[99,10,99,25],[100,1,101,9],[100,10,100,25],[101,10,101,25],[88,1,88,9],[88,10,88,25],[89,1,89,9],[89,10,89,25],[94,1,95,3],[94,4,95,6],[94,7,95,25],[83,1,83,9],[83,10,83,25],[84,1,86,9],[84,10,85,25],[86,10,86,25],[87,1,87,9],[87,10,87,25],[76,1,76,9],[76,10,76,25],[77,1,77,9],[77,10,77,25],[78,1,82,9],[78,10,78,25],[79,10,79,25],[80,10,80,25],[81,10,81,25],[82,10,82,25],[68,1,69,3],[68,4,69,6],[68,7,69,25],[70,1,72,9],[70,10,72,25],[73,1,75,9],[73,10,73,25],[74,10,74,25],[75,10,75,25],[46,1,46,9],[46,10,46,25],[47,1,47,9],[47,10,47,25],[48,1,48,9],[48,10,48,25],[42,1,42,9],[42,10,42,25],[43,1,45,9],[43,10,43,25],[44,10,44,25],[45,10,45,25],[38,1,38,9],[38,10,38,25],[39,1,39,9],[39,10,39,25],[40,1,41,9],[40,10,40,25],[41,10,41,25],[32,1,34,9],[32,10,34,25],[35,1,37,9],[35,10,35,25],[36,10,36,25],[37,10,37,25],[15,10,15,25],[24,1,24,9],[24,10,24,25],[25,1,25,9],[25,10,25,25],[30,1,31,3],[30,4,31,6],[30,7,31,25],[20,1,20,9],[20,10,20,25],[21,1,22,9],[21,10,21,25],[22,10,22,25],[23,1,23,9],[23,10,23,25],[63,0,64,26],[123,0,124,26],[183,0,184,26],[243,0,244,26],[303,0,304,26],[0,0,1,6],[0,7,1,19],[0,20,1,26],[3,0,4,26],[8,1,9,3],[8,4,9,6],[8,7,9,25],[16,1,16,9],[16,10,16,25],[17,1,17,9],[17,10,17,25],[18,1,19,9],[18,10,18,25],[19,10,19,25],[10,1,12,9],[10,10,12,25],[13,1,15,9],[13,10,13,25],[14,10,14,25]]}
[{"$f":"NCOM&\" (\"&PCOM&\")\"","v":"Comune di Trescore Cremasco (CR)"},null,null,null,null,null,null,{"$f":"IF(INDEX(INT,1,13)=\"\",INDEX(INT,1,1),INDEX(INT,1,13))","v":"Piano di Emergenza Intercomunale di Protezione Civile"},null,null,null,null,null,null,null,null,null,null,null,null,{"$f":"IF(TIPOP=\"Edizione\",\"Ed. \",IF(TIPOP=\"Revisione\",\"Rev. \",\"Bozza \"))&TIPON&\" del \"&TIPOD","v":"Ed. 01 del 04/11/2012"}]
[]
[]
["Procedure Operative Standard P.O.S."]
[]
[]
[]
[]
[null,"P.O.S.",null,null,1,null,null,"Monitoraggio"]
[]
[null,"Descrizione attività",null,null,null,null,null,null,null,null,"Consiste nel presidio di una località in cui sia possibile l’inizio o sia in atto un dissesto idrogeologico. "]
[]
[]
[null,"Personale Coinvolto",null,null,null,null,null,null,null,null,"Polizia Locale"]
[null,null,null,null,null,null,null,null,null,null,"Volontari P.C."]
[null,null,null,null,null,null,null,null,null,null,"Tecnici/Operai Comunali"]
[null,"Numero Operatori Consigliato",null,null,null,null,null,null,null,null,"Minimo 2 "]
[null,"Automezzo dedicato",null,null,null,null,null,null,null,null,"Non necessario"]
[null,"Equipaggiamento minimo consigliato ",null,null,null,null,null,null,null,null,"Vestiario alta visibilità EN471 - Impermeabile"]
[null,null,null,null,null,null,null,null,null,null,"Torcia elettrica"]
[null,"Modalità di comunicazione",null,null,null,null,null,null,null,null,"Cellulare / Radio"]
[null,"Azioni",null,null,null,null,null,null,null,null,"Osservare l’evoluzione dell’evento."]
[null,null,null,null,null,null,null,null,null,null,"Fare rapporti all’UCL ad intervalli regolari."]
[null,"Ubicazione Postazioni di Monitoraggio",null,null,null,null,null,null,null,null,"In accordo con il PE o dove stabilito dall'UCL."]
[null,"Termine intervento",null,null,null,null,null,null,null,null,"Concordato con PCA / UCL - Alla cessata Emergenza."]
[null,"Contatti Utili",null,null,null,null,null,null,null,null,"Si faccia riferimento al PRONTUARIO DI EMERGENZA - CONTATTI"]
[]
[]
[]
[]
[null,"P.O.S.",null,null,2,null,null,"Perlustrazione"]
[]
[null,"Descrizione attività",null,null,null,null,null,null,null,null,"Consiste nel controllo di ampie porzioni di territorio mediante pattuglie lungo percorsi che attraversino le aree a rischio."]
[]
[]
[null,"Personale Coinvolto",null,null,null,null,null,null,null,null,"Polizia Locale"]
[null,null,null,null,null,null,null,null,null,null,"Volontari P.C."]
[null,null,null,null,null,null,null,null,null,null,"Tecnici/Operai Comunali"]
[null,"Numero Operatori Consigliato",null,null,null,null,null,null,null,null,"Minimo 2 "]
[null,"Automezzo dedicato",null,null,null,null,null,null,null,null,"Si"]
[null,"Equipaggiamento minimo consigliato ",null,null,null,null,null,null,null,null,"Vestiario alta visibilità EN471 - Impermeabile"]
[null,null,null,null,null,null,null,null,null,null,"Torcia elettrica"]
[null,"Modalità di comunicazione",null,null,null,null,null,null,null,null,"Cellulare / Radio"]
[null,"Azioni",null,null,null,null,null,null,null,null,"Osservare l’evoluzione dell’evento."]
[null,null,null,null,null,null,null,null,null,null,"Fare rapporti all'UCL ad intervalli regolari sulla posizione della pattuglia."]
[null,null,null,null,null,null,null,null,null,null,"Comunicare all'UCL lo stato delle aree a rischio raggiunte."]
[null,"Ubicazione Intervento",null,null,null,null,null,null,null,null,"In accordo con il PE o dove stabilito dall'UCL."]
[null,"Termine intervento",null,null,null,null,null,null,null,null,"Concordato con PCA / UCL - Alla cessata Emergenza."]
[null,"Contatti Utili",null,null,null,null,null,null,null,null,"Si faccia riferimento al PRONTUARIO DI EMERGENZA - CONTATTI"]
[]
[]
[]
[]
[]
[]
[]
[]
[]
[]
[]
[]
[]
[]
["Procedure Operative Standard P.O.S."]
[]
[]
[]
[]
[null,"P.O.S.",null,null,3,null,null,"Presidio Cancelli/Supporto Viabilità"]
[]
[null,"Descrizione attività",null,null,null,null,null,null,null,null,"Posizionamento e presidio di cancelli, che regolino o interdicano l'accesso a vie o aree interessate da attività di protezione civile. "]
[]
[]
[null,"Personale Coinvolto",null,null,null,null,null,null,null,null,"Polizia Locale"]
[null,null,null,null,null,null,null,null,null,null,"Volontari P.C."]
[null,null,null,null,null,null,null,null,null,null,"Tecnici/Operai Comunali"]
[null,"Numero Operatori Consigliato",null,null,null,null,null,null,null,null,"Minimo 2 "]
[null,"Automezzo dedicato",null,null,null,null,null,null,null,null,"Si"]
[null,"Equipaggiamento minimo consigliato ",null,null,null,null,null,null,null,null,"Vestiario alta visibilità EN471 - Impermeabile"]
[null,null,null,null,null,null,null,null,null,null,"Torcia elettrica"]
[null,null,null,null,null,null,null,null,null,null,"Paletta"]
[null,null,null,null,null,null,null,null,null,null,"Transenne e/o nastro segnaletico"]
[null,null,null,null,null,null,null,null,null,null,"Cartelli segnaletici"]
[null,"Modalità di comunicazione",null,null,null,null,null,null,null,null,"Cellulare / Radio"]
[null,"Azioni",null,null,null,null,null,null,null,null,"Posizionare opportunamente transenne e segnaletica e presidiarle con continuità."]
[]
[null,null,null,null,null,null,null,null,null,null,"Fare rapporti all'UCL ad intervalli regolari."]
[null,"Ubicazione Intervento",null,null,null,null,null,null,null,null,"In accordo con il PE o dove stabilito dall'UCL."]
[null,"Termine intervento",null,null,null,null,null,null,null,null,"Concordato con PCA / UCL - Alla cessata Emergenza."]
[null,"Contatti Utili",null,null,null,null,null,null,null,null,"Si faccia riferimento al PRONTUARIO DI EMERGENZA - CONTATTI"]
[]
[]
[]
[]
[null,"P.O.S.",null,null,4,null,null,"Informazione Diretta alla Popolazione"]
[]
[null,"Descrizione attività",null,null,null,null,null,null,null,null,"Fornire alle persone esposte informazioni circa:"]
[null,null,null,null,null,null,null,null,null,null,"- la tipologia di evento calamitoso in atto;"]
[null,null,null,null,null,null,null,null,null,null,"- le misure di contrasto e/o prevenzione adottate;"]
[null,null,null,null,null,null,null,null,null,null,"- il comportamento da seguire."]
[null,"Personale Coinvolto",null,null,null,null,null,null,null,null,"Polizia Locale"]
[null,null,null,null,null,null,null,null,null,null,"Volontari P.C."]
[null,"Numero Operatori Consigliato",null,null,null,null,null,null,null,null,"Minimo 2 "]
[null,"Automezzo dedicato",null,null,null,null,null,null,null,null,"Si"]
[null,"Equipaggiamento minimo consigliato ",null,null,null,null,null,null,null,null,"Vestiario alta visibilità EN471 - Impermeabile"]
[null,null,null,null,null,null,null,null,null,null,"Torcia elettrica"]
[null,null,null,null,null,null,null,null,null,null,"Megafono o altoparlante"]
[null,"Modalità di comunicazione",null,null,null,null,null,null,null,null,"Cellulare / Radio"]
[null,"Azioni",null,null,null,null,null,null,null,null,"Organizzare la diffusione delle informazioni sul territorio di competenza."]
[null,"Ubicazione Intervento",null,null,null,null,null,null,null,null,"In accordo con il PE o dove stabilito dall'UCL."]
[null,"Termine intervento",null,null,null,null,null,null,null,null,"Concordato con PCA / UCL - Alla cessata Emergenza."]
[null,"Contatti Utili",null,null,null,null,null,null,null,null,"Si faccia riferimento al PRONTUARIO DI EMERGENZA - CONTATTI"]
[]
[]
[]
[]
[]
[]
[]
[]
[]
[]
[]
["Procedure Operative Standard P.O.S."]
[]
[]
[]
[]
[null,"P.O.S.",null,null,5,null,null,"Allestimento Area di Ricovero"]
[]
[null,"Descrizione attività",null,null,null,null,null,null,null,null,"Predisporre i materiali e le attrezzature necessarie all'accoglienza ed al ricovero della popolazione sfollata."]
[]
[]
[null,"Personale Coinvolto",null,null,null,null,null,null,null,null,"Polizia Locale"]
[null,null,null,null,null,null,null,null,null,null,"Volontari P.C."]
[null,null,null,null,null,null,null,null,null,null,"Tecnici/Operai Comunali"]
[null,"Numero Operatori Consigliato",null,null,null,null,null,null,null,null,"Minimo 2 squadre"]
[null,"Automezzo dedicato",null,null,null,null,null,null,null,null,"Si"]
[null,"Equipaggiamento minimo consigliato ",null,null,null,null,null,null,null,null,"Brande/Cuscini/Materassi/Coperte"]
[null,"Materiale Necessario",null,null,null,null,null,null,null,null,"Generi di prima necessità (Acqua, Carta igienica, viveri, ecc.)"]
[null,"Modalità di comunicazione",null,null,null,null,null,null,null,null,"Cellulare / Radio"]
[null,"Azioni",null,null,null,null,null,null,null,null,"Reperire, trasportare e posizionare i materiali presso le aree prescelte."]
[null,null,null,null,null,null,null,null,null,null,"Organizzare un servizio di accoglienza registrazione e smistamento."]
[null,null,null,null,null,null,null,null,null,null,"Verificare necessità di assistenza sanitaria ed eventualmente comunicarla all'UCL."]
[null,null,null,null,null,null,null,null,null,null,"Distribuire generi di prima necessità."]
[null,null,null,null,null,null,null,null,null,null,"Fornire agli ospiti assistenza continua."]
[null,null,null,null,null,null,null,null,null,null,"Fare periodico rapporto all'UCL."]
[null,"Ubicazione Intervento",null,null,null,null,null,null,null,null,"Aree definite nel PE o definite da UCL in emergenza."]
[null,"Termine intervento",null,null,null,null,null,null,null,null,"Concordato con PCA / UCL"]
[null,"Contatti Utili",null,null,null,null,null,null,null,null,"Si faccia riferimento al PRONTUARIO DI EMERGENZA - CONTATTI"]
[]
[]
[]
[]
[null,"P.O.S.",null,null,6,null,null,"Allestimento Area di Ammassamento Soccorsi"]
[]
[null,"Descrizione attività",null,null,null,null,null,null,null,null,"Predisporre i materiali e le attrezzature necessarie all'accoglienza dei soccorritori."]
[]
[]
[null,"Personale Coinvolto",null,null,null,null,null,null,null,null,"Polizia Locale"]
[null,null,null,null,null,null,null,null,null,null,"Volontari P.C."]
[null,null,null,null,null,null,null,null,null,null,"Tecnici/Operai Comunali"]
[null,"Numero Operatori Consigliato",null,null,null,null,null,null,null,null,"Minimo 2 squadre"]
[null,"Automezzo dedicato",null,null,null,null,null,null,null,null,"Si"]
[null,"Equipaggiamento minimo consigliato ",null,null,null,null,null,null,null,null,"Brande/Cuscini/Materassi/Coperte"]
[null,"Materiale Necessario",null,null,null,null,null,null,null,null,"Generi di prima necessità (Acqua, Carta igienica, viveri, ecc.)"]
[null,"Modalità di comunicazione",null,null,null,null,null,null,null,null,"Cellulare / Radio"]
[null,"Azioni",null,null,null,null,null,null,null,null,"Rendere accessibili le aree preventivamente individuate."]
[null,null,null,null,null,null,null,null,null,null,"Piantonare l'ingresso, accogliere registrare e dislocare mezzi e personale."]
[null,null,null,null,null,null,null,null,null,null,"Fare periodico rapporto all'UCL."]
[null,"Ubicazione Intervento",null,null,null,null,null,null,null,null,"Aree definite nel PE o definite da UCL in emergenza."]
[null,"Termine intervento",null,null,null,null,null,null,null,null,"Concordato con PCA / UCL"]
[null,"Contatti Utili",null,null,null,null,null,null,null,null,"Si faccia riferimento al PRONTUARIO DI EMERGENZA - CONTATTI"]
[]
[]
[]
[]
[]
[]
[]
[]
[]
[]
["Procedure Operative Standard P.O.S."]
[]
[]
[]
[]
[]
[]
[]
[null,"P.O.S.",null,null,7,null,null,"Evacuazione"]
[]
[null,"Descrizione attività",null,null,null,null,null,null,null,null,"Consiste nella notifica dell'ordinanza di evacuazione e verifica dell'esecuzione. "]
[]
[null,"Personale Coinvolto",null,null,null,null,null,null,null,null,"Polizia Locale (Eventualmente Forze dell'Ordine)"]
[null,null,null,null,null,null,null,null,null,null,"Volontari P.C."]
[null,null,null,null,null,null,null,null,null,null,"Tecnici/Operai Comunali"]
[null,"Numero Operatori Consigliato",null,null,null,null,null,null,null,null,"Almeno 2 per ogni area (obbligatoria la presenza di almeno 1 agente di Pubblica Sicurezza)."]
[]
[null,"Automezzo dedicato",null,null,null,null,null,null,null,null,"Si"]
[null,"Equipaggiamento minimo consigliato ",null,null,null,null,null,null,null,null,"Vestiario alta visibilità EN471 - Impermeabile"]
[null,null,null,null,null,null,null,null,null,null,"Torcia elettrica"]
[null,null,null,null,null,null,null,null,null,null,"Copia Ordinanza e Modulo M2 - Scheda Registrazione Persone Evacuate"]
[null,"Modalità di comunicazione",null,null,null,null,null,null,null,null,"Cellulare / Radio"]
[null,"Azioni",null,null,null,null,null,null,null,null,"Comunicazione ad ogni unità abitativa dell'allarme in atto e della necessità di evacuazione. "]
[]
[null,null,null,null,null,null,null,null,null,null,"Dare alla popolazione delle disposizioni per un corretto allontanamento."]
[null,null,null,null,null,null,null,null,null,null,"Informazione circa l'ubicazione dell'Area di Accoglienza/Ricovero."]
[null,null,null,null,null,null,null,null,null,null,"Comunicare all'UCL se le persone evacuate intendano usufruire dell'Area di Accoglienza/Ricovero o se provvedono da soli al proprio alloggiamento presso strutture private (alberghi, parenti, amici…); in tal caso comunicare anche un recapito telefonico per comunicazioni di urgenza."]
[]
[]
[]
[null,null,null,null,null,null,null,null,null,null,"Comunicare all'UCL il progressivo sgombero dei numeri civici interessati."]
[null,null,null,null,null,null,null,null,null,null,"A evacuazione ultimata presidio e controllo delle aree disabitate."]
[null,"Ubicazione Intervento",null,null,null,null,null,null,null,null,"In accordo con il PE o dove stabilito dall'UCL."]
[null,"Termine intervento",null,null,null,null,null,null,null,null,"Concordato con PCA / UCL - Alla cessata Emergenza."]
[null,"Contatti Utili",null,null,null,null,null,null,null,null,"Si faccia riferimento al PRONTUARIO DI EMERGENZA - CONTATTI"]
[]
[]
[]
[]
[]
[]
[]
[]
[]
[]
[]
[]
[]
[]
[]
[]
[]
[]
[]
[]
[]
[]
[]
[]
[]
["Procedure Operative Standard P.O.S."]
[]
[]
[]
[]
[null,"P.O.S.",null,null,8,null,null,"Rimozione Ostacoli"]
[]
[null,"Descrizione attività",null,null,null,null,null,null,null,null,"Rimuovere ostacoli di diverso genere (materiale franato o schiantato, o abbattuto)  che possano compromettere la viabilità o l’accesso ad aree strategiche  pubbliche o private."]
[]
[]
[null,null,null,null,null,null,null,null,null,null,"Oltre alla rimozione si prevede contestualmente od in alternativa la messa in sicurezza dell’area.  "]
[]
[null,"Personale Coinvolto",null,null,null,null,null,null,null,null,"Volontari P.C."]
[null,null,null,null,null,null,null,null,null,null,"Tecnici/Operai Comunali"]
[null,"Numero Operatori Consigliato",null,null,null,null,null,null,null,null,"Minimo 2 - meglio una squadra"]
[null,"Automezzo dedicato",null,null,null,null,null,null,null,null,"Si"]
[null,"Equipaggiamento minimo consigliato ",null,null,null,null,null,null,null,null,"Vestiario alta visibilità EN471 - Impermeabile - DPI antitaglio"]
[null,null,null,null,null,null,null,null,null,null,"Attrezzatura: badili, picconi, rastri , roncole, motosega, decespugliatori \n"]
[null,null,null,null,null,null,null,null,null,null,"Materiali di delimitazione: transenne e segnali"]
[]
[null,"Modalità di comunicazione",null,null,null,null,null,null,null,null,"Cellulare / Radio"]
[null,"Azioni",null,null,null,null,null,null,null,null,"Perimetrare l’area , inibirne l’accesso e verificarne la sicurezza."]
[null,null,null,null,null,null,null,null,null,null,"Rimuovere l’ostacolo direttamente e/o verificare se necessario con UCL l’invio di macchinari specifici"]
[]
[null,null,null,null,null,null,null,null,null,null,"Fare rapporti all’UCL ad intervalli regolari descrivendo lo stato dell’avanzamento dei lavori."]
[]
[null,"Ubicazione Intervento",null,null,null,null,null,null,null,null,"In accordo con il PE o dove stabilito dall'UCL."]
[null,"Termine intervento",null,null,null,null,null,null,null,null,"Concordato con PCA / UCL - Alla cessata Emergenza."]
[null,"Contatti Utili",null,null,null,null,null,null,null,null,"Si faccia riferimento al PRONTUARIO DI EMERGENZA - CONTATTI"]
[]
[]
[]
[]
[null,"P.O.S.",null,null,9,null,null,"Rimozione Ostacoli da Alveo"]
[]
[null,"Descrizione attività",null,null,null,null,null,null,null,null,"Rimuovere ostacoli di diverso genere (alberi, automobili, passerelle pedonali crollate, oggetti abbandonati di dimensioni rilevamnti, ecc. )  che possano compromettere il normale deflusso dell'acqua nell'alveo o che ostruiscano parzialmente la luce di un attraversamento. "]
[]
[]
[]
[null,null,null,null,null,null,null,null,null,null,"Oltre alla rimozione si prevede, se tecnicamente possibile, la definitiva messa in sicurezza dell’area.  "]
[]
[null,"Personale Coinvolto",null,null,null,null,null,null,null,null,"Volontari P.C."]
[null,null,null,null,null,null,null,null,null,null,"Tecnici/Operai Comunali"]
[null,"Numero Operatori Consigliato",null,null,null,null,null,null,null,null,"Almeno una squadra"]
[null,"Automezzo dedicato",null,null,null,null,null,null,null,null,"Si"]
[null,"Equipaggiamento minimo consigliato ",null,null,null,null,null,null,null,null,"Vestiario alta visibilità EN471 - Impermeabile - DPI antitaglio - Imbragatura o Dispositivi di Protezione Anticaduta"]
[]
[null,null,null,null,null,null,null,null,null,null,"Attrezzatura: badili, picconi, rastri , roncole, motosega, decespugliatori \n"]
[null,null,null,null,null,null,null,null,null,null,"Attrezzature speciali: se necessarie idonee macchine d'opera."]
[null,null,null,null,null,null,null,null,null,null,"Materiali di consumo: transenne e segnali"]
[null,"Modalità di comunicazione",null,null,null,null,null,null,null,null,"Cellulare / Radio"]
[null,"Azioni",null,null,null,null,null,null,null,null,"Perimetrare l’area, inibirne l’accesso e verificarne la sicurezza."]
[null,null,null,null,null,null,null,null,null,null,"Rimuovere l’ostacolo direttamente e/o verificare se necessario con UCL l’invio di macchinari specifici"]
[]
[null,null,null,null,null,null,null,null,null,null,"Fare rapporti all’UCL ad intervalli regolari descrivendo lo stato dell’avanzamento dei lavori."]
[]
[null,"Ubicazione Intervento",null,null,null,null,null,null,null,null,"In accordo con il PE o dove stabilito dall'UCL."]
[null,"Termine intervento",null,null,null,null,null,null,null,null,"Concordato con PCA / UCL - Alla cessata Emergenza."]
[null,"Contatti Utili",null,null,null,null,null,null,null,null,"Si faccia riferimento al PRONTUARIO DI EMERGENZA - CONTATTI"]
[]
["Procedure Operative Standard P.O.S."]
[]
[]
[]
[]
[null,"P.O.S.",null,null,10,null,null,"Preservazione Argini"]
[]
[null,"Descrizione attività",null,null,null,null,null,null,null,null,"Preparare e posizionare sacchetti di sabbia per arginature."]
[null,"Personale Coinvolto",null,null,null,null,null,null,null,null,"Polizia Locale"]
[null,null,null,null,null,null,null,null,null,null,"Volontari P.C."]
[null,null,null,null,null,null,null,null,null,null,"Tecnici/Operai Comunali"]
[null,"Numero Operatori Consigliato",null,null,null,null,null,null,null,null,"Una squadra per ogni sezione di argine a rischio."]
[null,"Automezzo dedicato",null,null,null,null,null,null,null,null,"Uno per  squadra."]
[null,"Equipaggiamento minimo consigliato ",null,null,null,null,null,null,null,null,"Vestiario alta visibilità EN471 - Impermeabile."]
[null,"Materiale Necessario",null,null,null,null,null,null,null,null,"Sabbia - sacchi in nylon o canapa - cordame - badili  - bancali - teli di cellophane o nylon  - idrovore ( almeno 1.000 lt/min) con aspirazione e tubi di mandata."]
[]
[]
[null,"Modalità di comunicazione",null,null,null,null,null,null,null,null,"Cellulare / Radio"]
[null,"Azioni",null,null,null,null,null,null,null,null,"Predisposizione in area sicura dei sacchi di sabbia da impiegare:"]
[null,null,null,null,null,null,null,null,null,null,"- nell' innalzamento degli argini;"]
[null,null,null,null,null,null,null,null,null,null,"- nell'interventi di confinamento dei fenomeni di sifonamento degli argini (fontanazzi);"]
[]
[null,null,null,null,null,null,null,null,null,null,"- nell'allestimento di barriere di protezione per gli accessi agli immobili più esposti."]
[]
[null,null,null,null,null,null,null,null,null,null,"Nelle aree arginate e sicure posizionare idrovore per l'allontanamento dell'acqua."]
[]
[null,null,null,null,null,null,null,null,null,null,"Fare rapporti all'UCL ad intervalli regolari descrivendo lo stato degli argini e l'avanzamento dei lavori."]
[]
[null,"Ubicazione Intervento",null,null,null,null,null,null,null,null,"In accordo con il PE o dove stabilito dall'UCL."]
[null,"Termine intervento",null,null,null,null,null,null,null,null,"Concordato con PCA / UCL - Alla cessata Emergenza."]
[null,"Contatti Utili",null,null,null,null,null,null,null,null,"Si faccia riferimento al PRONTUARIO DI EMERGENZA - CONTATTI"]
[]
[]
[null,"P.O.S.",null,null,11,null,null,"Frana"]
[]
[null,"Descrizione attività",null,null,null,null,null,null,null,null,"Mitigazione del rischio derivato da dissesti idrogeologici in evoluzione mediante interventi in emergenza eseguiti direttamente sul corpo di frana."]
[]
[]
[null,"Personale Coinvolto",null,null,null,null,null,null,null,null,"Volontari P.C."]
[null,null,null,null,null,null,null,null,null,null,"Tecnici/Operai Comunali"]
[null,"Numero Operatori Consigliato",null,null,null,null,null,null,null,null,"Minimo 2 - meglio una squadra"]
[null,"Automezzo dedicato",null,null,null,null,null,null,null,null,"Si"]
[null,"Equipaggiamento minimo consigliato ",null,null,null,null,null,null,null,null,"Vestiario alta visibilità EN471 - Impermeabile - DPI antitaglio"]
[null,null,null,null,null,null,null,null,null,null,"Attrezzatura: badili, picconi, rastri , roncole, motosega, decespugliatori.\n"]
[null,null,null,null,null,null,null,null,null,null,"Materiali di consumo:  teli di cellophane o nylon, transenne e segnali, materiali da costruzione."]
[]
[null,"Modalità di comunicazione",null,null,null,null,null,null,null,null,"Cellulare / Radio"]
[null,"Azioni",null,null,null,null,null,null,null,null,"Mettere in sicurezza le aree interessate dallo smottamento:"]
[null,null,null,null,null,null,null,null,null,null,"-  limitando, se possibile, l'afflusso di acqua alle aree in dissesto;"]
[null,null,null,null,null,null,null,null,null,null,"- perimetrare l'area interessata e, se possibile, coprire con teli impermeabili le aree soggette a smottamento."]
[]
[null,null,null,null,null,null,null,null,null,null,"- provvedere allo sgombero degli ostacoli come da POS dedicata"]
[null,null,null,null,null,null,null,null,null,null,"- attendere la consulenza di personale tecnico specializzato prima di mettere in atto ulteriori interventi o accedere all'area in dissesto."]
[]
[null,"Ubicazione Intervento",null,null,null,null,null,null,null,null,"In accordo con il PE o dove stabilito dall'UCL."]
[null,"Termine intervento",null,null,null,null,null,null,null,null,"Concordato con PCA / UCL - Alla cessata Emergenza."]
[null,"Contatti Utili",null,null,null,null,null,null,null,null,"Si faccia riferimento al PRONTUARIO DI EMERGENZA - CONTATTI"]

{"sheet":"IRD_3","index":15,"n_rows":451,"n_cols":27,"rows_kept":451,"cut":false,"hidden":false,"merged":[[450,1,451,9],[450,10,451,24],[113,23,113,25],[114,23,114,25],[116,23,116,25],[107,11,107,14],[107,15,107,18],[107,19,107,22],[104,0,105,4],[104,5,105,10],[104,11,104,14],[104,15,105,18],[104,19,105,22],[108,0,110,4],[108,5,110,10],[108,11,110,14],[108,15,110,18],[108,19,108,22],[109,19,109,22],[110,19,110,22],[396,10,396,24],[397,1,397,9],[449,1,449,9],[449,10,449,24],[72,23,72,25],[75,15,75,18],[76,15,76,18],[78,23,78,25],[79,23,79,25],[81,23,81,25],[82,23,82,25],[94,23,94,25],[95,23,95,25],[93,0,93,25],[94,0,97,4],[94,5,97,10],[94,15,97,18],[94,19,94,22],[89,0,92,4],[89,5,92,10],[89,11,92,14],[89,15,89,18],[89,19,92,22],[89,23,92,25],[90,15,90,18],[91,15,91,18],[92,15,92,18],[85,0,88,4],[39,1,43,9],[44,1,47,9],[329,10,329,24],[330,10,330,24],[323,10,323,24],[324,10,324,24],[325,10,325,24],[326,10,326,24],[327,10,327,24],[328,10,328,24],[39,10,40,24],[150,10,151,24],[152,10,153,24],[154,10,155,24],[156,10,157,24],[158,10,159,24],[313,10,313,24],[314,10,314,24],[328,1,331,9],[324,1,327,9],[331,10,331,24],[315,1,315,9],[317,10,317,24],[318,10,318,24],[442,1,443,9],[442,10,443,24],[444,1,444,9],[444,10,444,24],[445,1,445,9],[445,10,445,24],[446,1,448,9],[446,10,446,24],[447,10,447,24],[448,10,448,24],[436,1,436,9],[436,10,436,24],[437,1,441,9],[437,10,438,24],[439,10,440,24],[441,10,441,24],[423,0,424,22],[423,23,426,25],[425,0,426,22],[428,1,428,9],[428,10,428,24],[429,1,429,24],[430,1,431,9],[430,10,431,24],[432,1,433,9],[432,10,432,24],[433,10,433,24],[434,1,435,9],[434,10,435,24],[397,10,397,24],[398,1,399,9],[398,10,399,24],[374,1,375,9],[374,10,375,24],[376,1,376,9],[376,10,376,24],[377,1,389,9],[377,10,378,24],[379,10,379,24],[380,10,380,24],[381,10,385,24],[386,10,387,24],[388,10,389,24],[390,1,390,9],[390,10,390,24],[391,1,391,9],[391,10,391,24],[392,1,395,9],[392,10,392,24],[393,10,393,24],[394,10,394,24],[395,10,395,24],[396,1,396,9],[368,1,368,9],[368,10,368,24],[369,1,369,24],[370,1,371,9],[370,10,371,24],[372,1,373,9],[372,10,372,24],[373,10,373,13],[373,14,373,24],[363,0,364,22],[363,23,366,25],[365,0,366,22],[332,1,332,9],[332,10,332,24],[333,1,334,9],[333,10,333,24],[334,10,334,24],[335,1,335,9],[335,10,335,24],[336,1,336,9],[336,10,336,24],[337,1,338,9],[337,10,338,24],[319,10,320,24],[321,10,321,24],[322,10,322,24],[309,1,309,24],[310,1,311,9],[310,10,311,24],[312,1,314,9],[312,10,312,24],[315,10,315,24],[316,1,316,9],[316,10,316,24],[317,1,323,9],[272,10,272,24],[273,10,273,24],[274,10,274,24],[275,1,275,9],[275,10,275,24],[276,1,277,9],[276,10,277,24],[303,0,304,22],[303,23,306,25],[305,0,306,22],[250,10,252,24],[256,1,257,9],[256,10,256,24],[257,10,257,24],[253,10,255,24],[250,1,255,9],[308,1,308,9],[308,10,308,24],[258,1,259,9],[258,10,259,24],[260,1,260,9],[260,10,260,24],[261,1,266,9],[261,10,263,24],[264,10,265,24],[266,10,266,24],[267,1,268,9],[267,10,268,24],[269,1,270,9],[269,10,269,24],[270,10,270,24],[271,1,271,9],[271,10,271,24],[272,1,274,9],[166,1,166,9],[166,10,166,24],[167,1,167,9],[167,10,167,24],[248,1,248,9],[248,10,248,24],[249,1,249,24],[168,1,169,9],[168,10,169,24],[243,0,244,22],[243,23,246,25],[245,0,246,22],[134,1,134,9],[134,10,134,24],[135,1,135,9],[135,10,135,24],[136,1,142,9],[136,10,136,24],[137,10,138,24],[139,10,140,24],[141,10,141,24],[142,10,142,24],[143,1,161,9],[143,10,143,24],[144,10,145,24],[146,10,147,24],[148,10,149,24],[160,10,161,24],[162,1,162,9],[162,10,162,24],[163,1,165,9],[163,10,163,24],[164,10,165,24],[116,26,119,26],[117,19,117,22],[118,19,118,22],[119,0,119,4],[119,19,119,22],[123,0,124,22],[123,23,126,25],[125,0,126,22],[128,1,128,9],[128,10,128,24],[121,0,121,25],[130,1,131,9],[130,10,131,24],[132,1,133,9],[132,10,132,24],[133,10,133,24],[111,23,112,25],[115,0,115,25],[116,0,118,4],[116,5,119,10],[116,11,119,14],[116,15,119,18],[116,19,116,22],[111,0,112,4],[111,11,112,14],[111,15,112,18],[111,19,112,22],[129,13,129,24],[129,1,129,12],[104,26,107,26],[105,11,105,14],[106,0,106,4],[106,5,106,10],[106,11,106,14],[106,15,106,18],[106,19,106,22],[106,23,106,25],[107,0,107,4],[107,5,107,10],[107,23,107,25],[94,26,95,26],[95,19,95,22],[96,19,96,22],[96,26,103,26],[97,19,97,22],[98,0,101,4],[98,5,101,10],[98,15,101,18],[98,19,101,22],[99,11,99,14],[100,11,100,14],[102,0,102,4],[102,5,102,10],[102,11,102,14],[102,15,102,18],[102,19,102,22],[102,23,102,25],[103,0,103,4],[103,5,103,10],[103,11,103,14],[103,15,103,18],[103,19,103,22],[103,23,103,25],[98,23,98,24],[85,5,88,10],[85,11,88,14],[85,15,88,18],[85,19,88,22],[85,23,88,25],[84,0,84,4],[80,0,83,4],[80,5,83,10],[80,11,80,14],[80,15,83,18],[84,5,84,10],[84,11,84,14],[84,15,84,18],[84,19,84,22],[71,0,74,4],[71,5,74,10],[71,11,74,14],[71,15,74,18],[71,19,74,22],[80,26,84,26],[81,11,81,14],[81,19,81,22],[82,11,82,14],[82,19,82,22],[75,0,76,4],[75,5,76,10],[75,11,76,14],[75,19,76,22],[75,23,76,25],[77,0,77,25],[78,0,79,4],[78,5,79,10],[78,11,79,14],[78,15,79,18],[78,19,79,22],[83,11,83,14],[83,19,83,22],[84,23,84,25],[59,10,59,24],[57,1,57,9],[57,10,57,24],[58,1,58,9],[58,10,58,24],[68,0,70,4],[68,5,70,10],[68,11,68,25],[69,11,70,14],[69,15,70,18],[69,19,70,22],[69,23,70,25],[60,10,60,24],[61,10,61,24],[59,1,61,9],[48,10,49,24],[50,10,51,24],[52,1,53,9],[52,10,52,24],[53,10,53,24],[54,1,56,9],[54,11,54,24],[55,11,55,24],[56,11,56,24],[0,0,1,6],[0,7,1,18],[0,19,1,25],[3,0,4,22],[3,23,6,25],[5,0,6,22],[29,1,34,9],[35,1,38,9],[35,10,38,24],[15,1,18,9],[15,10,18,24],[19,1,21,9],[19,10,20,24],[9,1,9,9],[9,10,9,24],[10,1,10,9],[10,10,10,24],[11,1,14,9],[11,10,14,24],[21,10,21,12],[21,13,21,18],[21,19,21,24],[22,1,24,9],[25,1,28,9],[22,17,24,24],[22,10,22,16],[23,10,23,16],[24,10,24,16],[29,10,33,24],[34,10,34,24],[104,23,104,25],[113,0,114,4],[111,5,114,10],[113,11,114,14],[113,15,114,18],[113,19,114,22],[25,10,28,24],[63,0,64,22],[63,23,66,25],[65,0,66,22],[41,10,41,24],[42,10,42,24],[43,10,43,24],[44,10,44,24],[47,10,47,24],[45,10,45,24],[46,10,46,24],[48,1,51,9]]}
[{"$f":"NCOM&\" (\"&PCOM&\")\"","v":"Comune di Trescore Cremasco (CR)"},null,null,null,null,null,null,{"$f":"IF(INDEX(INT,1,13)=\"\",INDEX(INT,1,1),INDEX(INT,1,13))","v":"Piano di Emergenza Intercomunale di Protezione Civile"},null,null,null,null,null,null,null,null,null,null,null,{"$f":"IF(TIPOP=\"Edizione\",\"Ed. \",IF(TIPOP=\"Revisione\",\"Rev. \",\"Bozza \"))&TIPON&\" del \"&TIPOD","v":"Ed. 01 del 04/11/2012"}]
[]
[]
["Scheda Scenario",null,null,null,null,null,null,null,null,null,null,null,null,null,null,null,null,null,null,null,null,null,null,{"$f":"_RSS2","v":"IRD.3"}]
[]
[{"$f":"IF(INDEX(RSS2PAR,1,19)=\"\",INDEX(RSS2PAR,1,12),INDEX(RSS2PAR,1,19))","v":"Rischio Incidente Domus Nova S.p.a."}]
[]
[]
[]
[null,"Paragrafi di Riferimento ",null,null,null,null,null,null,null,null,{"$f":"INDEX(RSS2PAR,1,1) & INDEX(RSS2PAR,1,12)","v":"2.2.5 - 3.3.5 Procedure per il Rischio di Incidente Rilevante"}]
[null,"Codice Scheda",null,null,null,null,null,null,null,null,{"$f":"X4","v":"IRD.3"}]
[null,"Evento atteso",null,null,null,null,null,null,null,null,"Rotture o malfunzionamento dell'impianto con rilascio accidentale di gas Propano con conseguente dispersione in aria e generazione di Flash-Fire."]
[]
[]
[]
[null,"Attività U.C.L.",null,null,null,null,null,null,null,null,"Supporta e collabora col P.C.A. (Posto di Comando Avanzato), struttura guidata dal ROS dei VV.F. che gestisce in prima persona le operazioni di soccorso all'interno dell'area colpita."]
[]
[]
[]
[null,"Ubicazione intervento",null,null,null,null,null,null,null,null,"Sono identificate le seguenti aree circostanti allo stabilimento Domus Nova s.a.s.:"]
[]
[null,null,null,null,null,null,null,null,null,null,"Zona I",null,null,"ELEVATA LETALITA':",null,null,null,null,null,"175 m"]
[null,"Personale mobilitato",null,null,null,null,null,null,null,null,{"$f":"IF(INDEX(RSS2PER,1,1)=\"\",\"\",\"- \" & VLOOKUP(INDEX(RSS2PER,1,1),Personale,IF(INDEX(Personale,INDEX(RSS2PER,1,1),14)=\"\",2,14)))","v":"- Polizia Locale"},null,null,null,null,null,null,"Riportare la composizione delle squadre nel Modulo M1"]
[null,null,null,null,null,null,null,null,null,null,{"$f":"IF(INDEX(RSS2PER,1,2)=\"\",\"\",\"- \" & VLOOKUP(INDEX(RSS2PER,1,2),Personale,IF(INDEX(Personale,INDEX(RSS2PER,1,2),14)=\"\",2,14)))","v":"- Volontari P.C."}]
[null,null,null,null,null,null,null,null,null,null,{"$f":"IF(INDEX(RSS2PER,1,3)=\"\",\"\",\"- \" & VLOOKUP(INDEX(RSS2PER,1,3),Personale,IF(INDEX(Personale,INDEX(RSS2PER,1,3),14)=\"\",2,14)))","v":"- Tecnici/Operai Comunali"}]
[null,"Attività personale mobilitato",null,null,null,null,null,null,null,null,"Collaborazione con il PCA nelle attività di presidio dei cancelli del traffico, informazione alla popolazione ed assistenza alla popolazione evacuata."]
[]
[]
[]
[null,"Grado di coinvolgimento della popolazione",null,null,null,null,null,null,null,null,"La popolazione che può risultare coinvolta nelle zone di impatto è quella residente nella Zona I riportata in cartografia e coinvolge edifici ed aree all'aperto che possono essere notevolmente frequentate. Nella sezione 3.4 del PEE sono riportate le misure precauzionali da adottare per la salvaguardia della popolazione."]
[]
[]
[]
[]
[null,null,null,null,null,null,null,null,null,null,"Registrare le persone eventualmente evacuate nel Modulo M2"]
[null,"Cancelli e vie alternative",null,null,null,null,null,null,null,null,"In accordo all'allegato 5 del PEE, vengono posizionati dei cancelli con lo scopo di agevolare il transito dei soccorritori verso il PCA e per impedire l'accesso alle zone colpite. Il PCA, una volta istituito, può modificare la disposizione di tali cancelli."]
[]
[]
[]
[null,"Aree di raccolta popolazione",null,null,null,null,null,null,null,null,{"$f":"IF(INDEX(RSS2RIC,1,1)=\"\",\"In questa fase non è prevista l’attivazione di tali aree.\",\"Coerentemente a quanto riportato nel PEE, per questa emergenza \" & IF(INDEX(RSS2RIC,1,2)=\"\",\"è disponibile la seguente area:\",\"sono disponibili le seguenti aree:\"))","v":"In questa fase non è prevista l’attivazione di tali aree."}]
[]
[null,null,null,null,null,null,null,null,null,null,{"$f":"IF(INDEX(RSS2RIC,1,1)=\"\",\"\",\"- \" & VLOOKUP(INDEX(RSS2RIC,1,1),Ricovero,2))","v":""}]
[null,null,null,null,null,null,null,null,null,null,{"$f":"IF(INDEX(RSS2RIC,1,2)=\"\",\"\",\"- \" & VLOOKUP(INDEX(RSS2RIC,1,2),Ricovero,2))","v":""}]
[null,null,null,null,null,null,null,null,null,null,{"$f":"IF(INDEX(RSS2RIC,1,3)=\"\",\"\",\"- \" & VLOOKUP(INDEX(RSS2RIC,1,3),Ricovero,2))","v":""}]
[null,"Area di ricovero",null,null,null,null,null,null,null,null,{"$f":"IF(INDEX(RSS2RIC,1,4)=\"\",\"\",\"- \" & VLOOKUP(INDEX(RSS2RIC,1,4),Ricovero,2))","v":""}]
[null,null,null,null,null,null,null,null,null,null,{"$f":"IF(INDEX(RT3RIC,1,5)=\"\",\"\",\"- \"&VLOOKUP(INDEX(RT3RIC,1,5),Ricovero,2))","v":""}]
[null,null,null,null,null,null,null,null,null,null,{"$f":"IF(INDEX(RT3RIC,1,6)=\"\",\"\",\"- \"&VLOOKUP(INDEX(RT3RIC,1,6),Ricovero,2))","v":""}]
[null,null,null,null,null,null,null,null,null,null,{"$f":"IF(K43=\"\",\"\",\"In funzione della gravità della situazione si decide quali/quante aree attivare.\")","v":""}]
[null,"Area di raduno soccorritori",null,null,null,null,null,null,null,null,"Come riportato in cartografia, si propone di posizionare il PCA presso il pargheggio del Cimitero Nuovo in Via Manzoni."]
[]
[null,null,null,null,null,null,null,null,null,null,"Il ROS dei VVF pùò scegliere il luogo più opportuno, anche in luoghi diversi da quello proposto."]
[]
[null,"Ordinanze Necessarie",null,null,null,null,null,null,null,null,"Ordinanza di Evacuazione;"]
[null,null,null,null,null,null,null,null,null,null,"Ordinanza di Chiusura Strade."]
[null,"Modalita’ Riunione U.C.L.",null,null,null,null,null,null,null,null,null,"Non necessaria"]
[null,null,null,null,null,null,null,null,null,null,"X","Virtuale"]
[null,null,null,null,null,null,null,null,null,null,"X","In sede"]
[null,"Possibili Scenari Concomitanti",null,null,null,null,null,null,null,null,"Non ragionevolmente prevedibile la concomitanza con altri eventi."]
[null,"Contatti Utili",null,null,null,null,null,null,null,null,{"$f":"\"Consultare il \"&IF([1]Maschera!Z71=\"\",[1]Maschera!N71,[1]Maschera!Z71)","v":"Consultare il Tomo Giallo - Risorse"}]
[null,"Cartografia",null,null,null,null,null,null,null,null,{"$f":"INDEX(RSS2PAR,1,28)","v":0}]
[null,null,null,null,null,null,null,null,null,null,{"$f":"INDEX(RSS2PAR,1,39)","v":0}]
[null,null,null,null,null,null,null,null,null,null,{"$f":"INDEX(RSS2PAR,1,50)","v":0}]
[]
[{"$f":"Titolo2","v":"Procedure U.C.L."},null,null,null,null,null,null,null,null,null,null,null,null,null,null,null,null,null,null,null,null,null,null,{"$f":"X4","v":"IRD.3"}]
[]
[{"$f":"$A$6","v":"Rischio Incidente Domus Nova S.p.a."}]
[]
[]
["RESPONSABILE",null,null,null,null,"AZIONE",null,null,null,null,null,"CHIAMATE"]
[null,null,null,null,null,null,null,null,null,null,null,"MEMBRO UCL",null,null,null,"OPERATIVI",null,null,null,"ENTE INTERESSATO",null,null,null,"SCHEDE RISORSE"]
[]
[{"$f":"IF(INDEX(PL,1,9)=\"\",INDEX(PL,1,1),INDEX(PL,1,9))","v":"POLIZIA LOCALE"},null,null,null,null,"Su segnalazione di cittadini o da parte della Domus Nova s.a.s. effettua sopralluogo nell'area interessata.",null,null,null,null,null,{"$f":"\"- \" & PROPER(IF(INDEX(RT,1,9)=\"\",INDEX(RT,1,1),INDEX(RT,1,9)))","v":"- Resp. Territorio"},null,null,null,{"$f":"\"- \" & IF(INDEX(PLO,1,9)=\"\",INDEX(PLO,1,1),INDEX(PLO,1,9))","v":"- Agenti P.L."},null,null,null,"--"]
[null,null,null,null,null,null,null,null,null,null,null,null,null,null,null,null,null,null,null,null,null,null,null,"O1 - O2  A2.2"]
[]
[]
[{"$f":"IF(INDEX(RT,1,9)=\"\",INDEX(RT,1,1),INDEX(RT,1,9))","v":"RESP. TERRITORIO"},null,null,null,null,"Collabora nell'organizzazione del sopralluogo.",null,null,null,null,null,"--",null,null,null,{"$f":"\"- \"&IF(INDEX(TCO,1,9)=\"\",INDEX(TCO,1,1),INDEX(TCO,1,9))","v":"- Tecnici Comunali"},null,null,null,"--",null,null,null,"A2.1  B2  C3"]
[null,null,null,null,null,null,null,null,null,null,null,null,null,null,null,{"$f":"\"- \"&IF(INDEX(PTO,1,9)=\"\",INDEX(PTO,1,1),INDEX(PTO,1,9))","v":"- Professionisti"}]
["SE L'INCIDENTE COINVOLGE SOSTANZE CHIMICHE"]
[{"$f":"IF(INDEX(Sindaco,1,9)=\"\",INDEX(Sindaco,1,1),INDEX(Sindaco,1,9))","v":"SINDACO / R.O.C."},null,null,null,null,"Attiva l'UCL e avverte i VV.F. ",null,null,null,null,null,"- Tutti",null,null,null,{"$f":"\"- \" & IF(INDEX(VF,1,9)=\"\",INDEX(VF,1,1),INDEX(VF,1,9))","v":"- VV.F."},null,null,null,{"$f":"\"- \"&IF(INDEX(REG,1,9)=\"\",INDEX(REG,1,1),INDEX(REG,1,9))","v":"- Regione"},null,null,null,"O1 - O2"]
[null,null,null,null,null,null,null,null,null,null,null,null,null,null,null,null,null,null,null,null,null,null,null,"C2.1  C2.4"]
[{"$f":"IF(INDEX(PL,1,9)=\"\",INDEX(PL,1,1),INDEX(PL,1,9))","v":"POLIZIA LOCALE"},null,null,null,null,{"$f":"\"In accordo al PEC, organizza i cancelli per il traffico  e informa la popolazione. \" &_RSS2 & \".1\"","v":"In accordo al PEC, organizza i cancelli per il traffico  e informa la popolazione. IRD.3.1"},null,null,null,null,null,null,null,null,null,{"$f":"\"- \" & IF(INDEX(PLO,1,9)=\"\",INDEX(PLO,1,1),INDEX(PLO,1,9))","v":"- Agenti P.L."},null,null,null,null,null,null,null," ",null,null,{"$f":"_RSS2 & \".1\"","v":"IRD.3.1"}]
[null,null,null,null,null,null,null,null,null,null,null,{"$f":"\"- \" & PROPER(IF(INDEX(Sindaco,1,9)=\"\",INDEX(Sindaco,1,1),INDEX(Sindaco,1,9)))","v":"- Sindaco / R.O.C."},null,null,null,null,null,null,null,{"$f":"\"- \"&IF(INDEX(CL,1,9)=\"\",INDEX(CL,1,1),INDEX(CL,1,9))","v":"- Comuni Limitrofi"},null,null,null,"O1 - O2"]
[null,null,null,null,null,null,null,null,null,null,null,{"$f":"\"- \" & PROPER(IF(INDEX(CV,1,9)=\"\",INDEX(CV,1,1),INDEX(CV,1,9)))","v":"- C. Volontariato"},null,null,null,null,null,null,null,{"$f":"\"- \"&IF(INDEX(PRO,1,9)=\"\",INDEX(PRO,1,1),INDEX(PRO,1,9))","v":"- Provincia"},null,null,null," A2.2   C2.1"]
[]
[{"$f":"IF(INDEX(CV,1,9)=\"\",INDEX(CV,1,1),INDEX(CV,1,9))","v":"C. VOLONTARIATO"},null,null,null,null,{"$f":"\"Coadiuva \" & _RSS2 &\".1\"","v":"Coadiuva IRD.3.1"},null,null,null,null,null,"--",null,null,null,{"$f":"\"- \" & IF(INDEX(VO,1,9)=\"\",INDEX(VO,1,1),INDEX(VO,1,9))","v":"- Gruppi Volontari"},null,null,null,"--",null,null,null,"A3 - B3"]
[{"$f":"IF(INDEX(Sindaco,1,9)=\"\",INDEX(Sindaco,1,1),INDEX(Sindaco,1,9))","v":"SINDACO / R.O.C."},null,null,null,null,"Appena costituito, manda il C.te della Polizia Locale o delegato a fare parte del PCA e si coordina con esso.",null,null,null,null,null,{"$f":"\"- \" & PROPER(IF(INDEX(PL,1,9)=\"\",INDEX(PL,1,1),INDEX(PL,1,9)))","v":"- Polizia Locale"},null,null,null,"--",null,null,null,"--",null,null,null,"O1 - O2"]
[]
[]
[]
[{"$f":"IF(INDEX(RT,1,9)=\"\",INDEX(RT,1,1),INDEX(RT,1,9))","v":"RESP. TERRITORIO"},null,null,null,null,"Su richiesta del PCA sospende l'erogazione dei servizi essenziali",null,null,null,null,null,"--",null,null,null,{"$f":"\"- \" & IF(INDEX(TCO,1,9)=\"\",INDEX(TCO,1,1),INDEX(TCO,1,9))","v":"- Tecnici Comunali"},null,null,null,"--",null,null,null,"A2.1  C1"]
[null,null,null,null,null,null,null,null,null,null,null,null,null,null,null,{"$f":"\"- \" & IF(INDEX(GEE,1,9)=\"\",INDEX(GEE,1,1),INDEX(GEE,1,9))","v":"- Gestore Elettricità"}]
[null,null,null,null,null,null,null,null,null,null,null,null,null,null,null,{"$f":"\"- \" & IF(INDEX(GEG,1,9)=\"\",INDEX(GEG,1,1),INDEX(GEG,1,9))","v":"- Gestore Gas"}]
[null,null,null,null,null,null,null,null,null,null,null,null,null,null,null,{"$f":"\"- \" & IF(INDEX(GEA,1,9)=\"\",INDEX(GEA,1,1),INDEX(GEA,1,9))","v":"- Gestore Acquedotto"}]
["SE VI E' RISCHIO PER LA SALUTE PUBBLICA"]
[{"$f":"IF(INDEX(Sindaco,1,9)=\"\",INDEX(Sindaco,1,1),INDEX(Sindaco,1,9))","v":"SINDACO / R.O.C."},null,null,null,null,{"$f":"\"In accordo col PCA attiva le aree di emergenza (\"&_RSS2 &\".2),\" &\" e dispone le evacuazioni.  (\"&_RSS2 &\".3).\"","v":"In accordo col PCA attiva le aree di emergenza (IRD.3.2), e dispone le evacuazioni.  (IRD.3.3)."},null,null,null,null,null,null,null,null,null,"--",null,null,null,{"$f":"\"- \"&IF(INDEX(PR,1,9)=\"\",INDEX(PR,1,1),INDEX(PR,1,9))","v":"- Prefettura"}]
[null,null,null,null,null,null,null,null,null,null,null,{"$f":"\"- \" & PROPER(IF(INDEX(PL,1,9)=\"\",INDEX(PL,1,1),INDEX(PL,1,9)))","v":"- Polizia Locale"},null,null,null,null,null,null,null,{"$f":"\"- \"&IF(INDEX(PRO,1,9)=\"\",INDEX(PRO,1,1),INDEX(PRO,1,9))","v":"- Provincia"},null,null,null,"O1 - O2"]
[null,null,null,null,null,null,null,null,null,null,null,{"$f":"\"- \" & PROPER(IF(INDEX(RT,1,9)=\"\",INDEX(RT,1,1),INDEX(RT,1,9)))","v":"- Resp. Territorio"},null,null,null,null,null,null,null,{"$f":"\"- \"&IF(INDEX(REG,1,9)=\"\",INDEX(REG,1,1),INDEX(REG,1,9))","v":"- Regione"},null,null,null,"C2.1","C2.3","C2.4",{"$f":"_RSS2 & \".2\"","v":"IRD.3.2"}]
[]
[{"$f":"IF(INDEX(RT,1,9)=\"\",INDEX(RT,1,1),INDEX(RT,1,9))","v":"RESP. TERRITORIO"},null,null,null,null,{"$f":"\"Responsabile \" & _RSS2 &\".2\"","v":"Responsabile IRD.3.2"},null,null,null,null,null,null,null,null,null,{"$f":"\"- \" & IF(INDEX(TCO,1,9)=\"\",INDEX(TCO,1,1),INDEX(TCO,1,9))","v":"- Tecnici Comunali"},null,null,null,"--",null,null,null,"O1 - O2",null,"A2.1"]
[null,null,null,null,null,null,null,null,null,null,null,{"$f":"\"- \" & PROPER(IF(INDEX(CV,1,9)=\"\",INDEX(CV,1,1),INDEX(CV,1,9)))","v":"- C. Volontariato"},null,null,null,null,null,null,null,null,null,null,null,"A4","A5","A6"]
[null,null,null,null,null,null,null,null,null,null,null,{"$f":"\"- \" & PROPER(IF(INDEX(RSS,1,9)=\"\",INDEX(RSS,1,1),INDEX(RSS,1,9)))","v":"- Resp. Serv. Sociali"},null,null,null,null,null,null,null,null,null,null,null,"A7.1","A7.2","B5"]
[null,null,null,null,null,null,null,null,null,null,null,null,null,null,null,null,null,null,null,null,null,null,null,"B6","C1","C3"]
[{"$f":"IF(INDEX(CV,1,9)=\"\",INDEX(CV,1,1),INDEX(CV,1,9))","v":"C. VOLONTARIATO"},null,null,null,null,{"$f":"\"Coadiuva \" & _RSS2 &\".2\"","v":"Coadiuva IRD.3.2"},null,null,null,null,null,"--",null,null,null,{"$f":"\"- \" & IF(INDEX(VO,1,9)=\"\",INDEX(VO,1,1),INDEX(VO,1,9))","v":"- Gruppi Volontari"},null,null,null,"--",null,null,null,"A3 - B3"]
[{"$f":"IF(INDEX(RSS,1,9)=\"\",INDEX(RSS,1,1),INDEX(RSS,1,9))","v":"RESP. SERV. SOCIALI"},null,null,null,null,{"$f":"\"Coadiuva \" & _RSS2 &\".2\"","v":"Coadiuva IRD.3.2"},null,null,null,null,null,"--",null,null,null,{"$f":"\"- \" & IF(INDEX(SO,1,9)=\"\",INDEX(SO,1,1),INDEX(SO,1,9))","v":"- Pers. Sanitario"},null,null,null,"--",null,null,null,"B1 - C2.2 - D1 "]
[{"$f":"IF(INDEX(PL,1,9)=\"\",INDEX(PL,1,1),INDEX(PL,1,9))","v":"POLIZIA LOCALE"},null,null,null,null,{"$f":"\"Responsabile \" & _RSS2 &\".3\"","v":"Responsabile IRD.3.3"},null,null,null,null,null,{"$f":"\"- \" & PROPER(IF(INDEX(CV,1,9)=\"\",INDEX(CV,1,1),INDEX(CV,1,9)))","v":"- C. Volontariato"},null,null,null,{"$f":"\"- \" & IF(INDEX(PLO,1,9)=\"\",INDEX(PLO,1,1),INDEX(PLO,1,9))","v":"- Agenti P.L."},null,null,null,"--",null,null,null,"O1 - O2  A2.2",null,null,{"$f":"_RSS2 & \".3\"","v":"IRD.3.3"}]
[null,null,null,null,null,null,null,null,null,null,null,{"$f":"\"- \" & PROPER(IF(INDEX(CC,1,9)=\"\",INDEX(CC,1,1),INDEX(CC,1,9)))","v":"- C. Carabinieri"},null,null,null,null,null,null,null,null,null,null,null,"M2","D2"]
[{"$f":"IF(INDEX(CV,1,9)=\"\",INDEX(CV,1,1),INDEX(CV,1,9))","v":"C. VOLONTARIATO"},null,null,null,null,{"$f":"\"Coadiuva \" & _RSS2 &\".3\"","v":"Coadiuva IRD.3.3"},null,null,null,null,null,"--",null,null,null,{"$f":"\"- \" & IF(INDEX(VO,1,9)=\"\",INDEX(VO,1,1),INDEX(VO,1,9))","v":"- Gruppi Volontari"},null,null,null,"--",null,null,null,"A3 - B3"]
[{"$f":"IF(INDEX(CC,1,9)=\"\",INDEX(CC,1,1),INDEX(CC,1,9))","v":"C. CARABINIERI"},null,null,null,null,{"$f":"\"Coadiuva \" & _RSS2 &\".3\"","v":"Coadiuva IRD.3.3"},null,null,null,null,null,"--",null,null,null,{"$f":"\"- \" & IF(INDEX(CO,1,9)=\"\",INDEX(CO,1,1),INDEX(CO,1,9))","v":"- Carabinieri"},null,null,null,"--",null,null,null,"--"]
[{"$f":"IF(INDEX(Sindaco,1,9)=\"\",INDEX(Sindaco,1,1),INDEX(Sindaco,1,9))","v":"SINDACO / R.O.C."},null,null,null,null,"Informa periodicamente gli enti sovraordinati e i media su quanto fatto.",null,null,null,null,null,"--",null,null,null,"--",null,null,null,{"$f":"\"- \"&IF(INDEX(PR,1,9)=\"\",INDEX(PR,1,1),INDEX(PR,1,9))","v":"- Prefettura"}]
[null,null,null,null,null,null,null,null,null,null,null,null,null,null,null,null,null,null,null,{"$f":"\"- \"&IF(INDEX(PRO,1,9)=\"\",INDEX(PRO,1,1),INDEX(PRO,1,9))","v":"- Provincia"},null,null,null,"C2.1","C2.3","C2.4"]
[null,null,null,null,null,null,null,null,null,null,null,null,null,null,null,null,null,null,null,{"$f":"\"- \"&IF(INDEX(REG,1,9)=\"\",INDEX(REG,1,1),INDEX(REG,1,9))","v":"- Regione"}]
[{"$f":"IF(INDEX(PL,1,9)=\"\",INDEX(PL,1,1),INDEX(PL,1,9))","v":"POLIZIA LOCALE"},null,null,null,null,"A seguito di nulla-osta del PCA collabora nelle operazioni di soccorso",null,null,null,null,null,{"$f":"\"- \" & PROPER(IF(INDEX(CV,1,9)=\"\",INDEX(CV,1,1),INDEX(CV,1,9)))","v":"- C. Volontariato"},null,null,null,{"$f":"\"- \" & IF(INDEX(PLO,1,9)=\"\",INDEX(PLO,1,1),INDEX(PLO,1,9))","v":"- Agenti P.L."},null,null,null,"--",null,null,null,"O1 - O2  A2.2"]
[]
[{"$f":"IF(INDEX(CV,1,9)=\"\",INDEX(CV,1,1),INDEX(CV,1,9))","v":"C. VOLONTARIATO"},null,null,null,null,null,null,null,null,null,null,{"$f":"\"- \" & PROPER(IF(INDEX(PL,1,9)=\"\",INDEX(PL,1,1),INDEX(PL,1,9)))","v":"- Polizia Locale"},null,null,null,{"$f":"\"- \" & IF(INDEX(VO,1,9)=\"\",INDEX(VO,1,1),INDEX(VO,1,9))","v":"- Gruppi Volontari"},null,null,null,"--",null,null,null,"O1 - O2"]
[null,null,null,null,null,null,null,null,null,null,null,null,null,null,null,null,null,null,null,null,null,null,null,"A3 - B3"]
["AD INTERVENTI DI MITIGAZIONE E MESSA IN SICUREZZA AVVENUTI"]
[{"$f":"IF(INDEX(Sindaco,1,9)=\"\",INDEX(Sindaco,1,1),INDEX(Sindaco,1,9))","v":"SINDACO / R.O.C."},null,null,null,null,{"$f":"\"Informa sulla revoca dello Stato di Emergenza e ordina il rientro degli sfollati. Informa la popolazione coinvolta. \" & _RSS2 &\".4\"","v":"Informa sulla revoca dello Stato di Emergenza e ordina il rientro degli sfollati. Informa la popolazione coinvolta. IRD.3.4"},null,null,null,null,null,"- Tutti",null,null,null,{"$f":"\"- \" & IF(INDEX(SC,1,9)=\"\",INDEX(SC,1,1),INDEX(SC,1,9))","v":"- Squadre Operativi"},null,null,null,{"$f":"\"- \"&IF(INDEX(PR,1,9)=\"\",INDEX(PR,1,1),INDEX(PR,1,9))","v":"- Prefettura"},null,null,null,"O1 - O2",null,null,{"$f":"_RSS2 & \".4\"","v":"IRD.3.4"}]
[null,null,null,null,null,null,null,null,null,null,null,null,null,null,null,null,null,null,null,{"$f":"\"- \"&IF(INDEX(PRO,1,9)=\"\",INDEX(PRO,1,1),INDEX(PRO,1,9))","v":"- Provincia"},null,null,null,"C2.1","C2.3","C2.4"]
[null,null,null,null,null,null,null,null,null,null,null,null,null,null,null,null,null,null,null,{"$f":"\"- \"&IF(INDEX(REG,1,9)=\"\",INDEX(REG,1,1),INDEX(REG,1,9))","v":"- Regione"},null,null,null,"M1","M2"]
["MEMBRI U.C.L"]
[]
["PER LE COMUNICAZIONI EVIDENZIATE IN ROSSO UTILIZZARE IL MODULO FAX M4"]
[]
[{"$f":"Titolo3","v":"Scheda Procedura Operativa"},null,null,null,null,null,null,null,null,null,null,null,null,null,null,null,null,null,null,null,null,null,null,{"$f":"$X$4 &\".1\"","v":"IRD.3.1"}]
[]
[{"$f":"$A$6","v":"Rischio Incidente Domus Nova S.p.a."}]
[]
[]
[null,"Codice Scheda Scenario",null,null,null,null,null,null,null,null,{"$f":"UIRD.3","v":"IRD.3"}]
[null,"AZIONI DI SALVAGUARDIA",null,null,null,null,null,null,null,null,null,null,null," - POSIZIONAMENTO CANCELLI"]
[null,"Descrizione attività",null,null,null,null,null,null,null,null,"Predisposizione di cancelli per il traffico con finalità di blocco totale del traffico in ingresso alla zona interessata. "]
[]
[null,"Personale coinvolto",null,null,null,null,null,null,null,null,{"$f":"$K$23","v":"- Polizia Locale"}]
[null,null,null,null,null,null,null,null,null,null,{"$f":"$K$24","v":"- Volontari P.C."}]
[null,"Numero Operatori",null,null,null,null,null,null,null,null,"Ad ogni cancello un agente di Polizia Locale ed un Volontario di P.C."]
[null,"Automezzo dedicato",null,null,null,null,null,null,null,null,"--"]
[null,"Azioni",null,null,null,null,null,null,null,null,"Il presidio dei cancelli è effettuato con i seguenti criteri:"]
[null,null,null,null,null,null,null,null,null,null,"- Non deve essere consentito l'accesso a nessun mezzo privato, compresi i residenti al di fuori delle aree di impatto."]
[]
[null,null,null,null,null,null,null,null,null,null,"- Informare i residenti sulle motivazioni del blocco seguendo le istruzioni del PCA/UCL."]
[]
[null,null,null,null,null,null,null,null,null,null,"- L'accesso è quindi consentito SOLO ai mezzi di soccorso."]
[null,null,null,null,null,null,null,null,null,null,"- Fare un periodico rapporto al PCA/UCL."]
[null,"Posizionamento Cancelli",null,null,null,null,null,null,null,null,"I cancelli sono posizionati come da cartografia allegata:"]
[null,null,null,null,null,null,null,null,null,null,"N° 1: Incrocio SS342 con Via Mazzini - Comune di Villa Guardia. Dirzione vietata: Accesso alla SS342 solo ai residenti"]
[]
[null,null,null,null,null,null,null,null,null,null,"N° 2: Incrocio SS342 con Via Manzoni e Via Liveria. Dirzione vietata: SS342 direzione Sud"]
[]
[null,null,null,null,null,null,null,null,null,null,"N° 3: Rotonda SS342 con Via Roma, Via Ratti e Via Lovesana. Dirzione vietata: Accesso alla SS342 solo ai residenti"]
[]
[null,null,null,null,null,null,null,null,null,null,"N° 4: Rotonda SS342 con Via Valtellina. Dirzione vietata: SS342 direzione Nord"]
[]
[null,null,null,null,null,null,null,null,null,null,"N° 5: Rotonda Via Valtellina con Via Leopardi e Via dell'Industria. Dirzione vietata: Via Valtellina direzione Est"]
[]
[null,null,null,null,null,null,null,null,null,null,"N° 6: Incrocio Via Mazzini con SS342. Dirzione vietata: Accesso da Via Mazzini alla SS342"]
[]
[null,null,null,null,null,null,null,null,null,null,"N° 7: Incrocio Via Leopardi con Via Manzoni. Dirzione vietata: Via Leopardi"]
[]
[null,null,null,null,null,null,null,null,null,null,"N° 8: Rotonda Via Manzoni con Via Valtellina e Via Mantero. Dirzione vietata: Via Valtellina"]
[]
[null,null,null,null,null,null,null,null,null,null,"N° 9: Incrocio Via Valtellina con Via Strada Nuova. Dirzione vietata: Via Valtellina direzione Ovest"]
[]
[null,"Modalità di comunicazione",null,null,null,null,null,null,null,null,"Cellulare / Radio"]
[null,"Equipaggiamento minimo consigliato ",null,null,null,null,null,null,null,null,"Vestiario alta visibilità EN471 – Impermeabile"]
[null,null,null,null,null,null,null,null,null,null,"Torcia elettrica  - Paletta - Transenne e/o nastro segnaletico - Cartelli segnaletici"]
[]
[null,"Procedure Operativa Standard (POS)",null,null,null,null,null,null,null,null,"Presidio Cancelli/Supporto Viabilità"]
[null,"Termine intervento",null,null,null,null,null,null,null,null,"Concordato con PCA / UCL - Alla cessata Emergenza"]
[null,"Contatti Utili",null,null,null,null,null,null,null,null,"Si faccia riferimento al PRONTUARIO DI EMERGENZA - CONTATTI"]
[]
[]
[]
[]
[]
[]
[]
[]
[]
[]
[]
[]
[]
[]
[]
[]
[]
[]
[]
[]
[]
[]
[]
[]
[]
[]
[]
[]
[]
[]
[]
[]
[]
[]
[]
[]
[]
[]
[]
[]
[]
[]
[]
[]
[]
[]
[]
[]
[]
[]
[]
[]
[]
[]
[]
[]
[]
[]
[]
[]
[]
[]
[]
[]
[]
[]
[]
[]
[]
[]
[]
[]
[]
[]
["Scheda Procedura",null,null,null,null,null,null,null,null,null,null,null,null,null,null,null,null,null,null,null,null,null,null,{"$f":"$X$4 &\".1\"","v":"IRD.3.1"}]
[]
[{"$f":"$A$6","v":"Rischio Incidente Domus Nova S.p.a."}]
[]
[]
[null,"Codice Scheda Scenario",null,null,null,null,null,null,null,null,{"$f":"UIRD.3","v":"IRD.3"}]
[null,"AZIONI DI SALVAGUARDIA - PERLUSTRAZIONE ED INFORMAZIONE ALLA POPOLAZIONE"]
[null,"Descrizione attività",null,null,null,null,null,null,null,null,"Al di fuori delle zone a rischio o comunque in accordo al PCA, eseguire una perlustrazione del territorio e fornire informazioni alla popolazione."]
[]
[]
[null,null,null,null,null,null,null,null,null,null,"L'informazioni alla popolazione all'interno delle aree di danno deve essere necessariamente condotta in accordo al PEE e sentita la direzione soccorsi."]
[]
[]
[null,"Personale coinvolto",null,null,null,null,null,null,null,null,{"$f":"$K$24","v":"- Volontari P.C."}]
[null,null,null,null,null,null,null,null,null,null,{"$f":"$K$23","v":"- Polizia Locale"}]
[null,"Numero Operatori",null,null,null,null,null,null,null,null,"Due squadre composte da un agente di Polizia Locale ed un Volontario di P.C."]
[]
[null,"Automezzo dedicato",null,null,null,null,null,null,null,null,"Uno per ogni squadra"]
[null,"Azioni",null,null,null,null,null,null,null,null,"- Informare la popolazione dell'incidente e della possibile difficoltà di circolazione dovuta alle deviazioni del traffico veicolare imposte dal P.E.E."]
[]
[]
[null,null,null,null,null,null,null,null,null,null,"- le informazioni di cui sopra devono essere impartite seguendo le modalità del P.E.E - Allegato 4."]
[]
[null,null,null,null,null,null,null,null,null,null,"- Fare un periodico rapporto al PCA/UCL."]
[null,"Ubicazione Intervento",null,null,null,null,null,null,null,null,"Tutto il territorio comunale all'interno dei posti di blocco e al di fuori delle zone a rischio."]
[]
[null,"Procedure Operativa Standard (POS)",null,null,null,null,null,null,null,null,"Perlustrazione"]
[null,null,null,null,null,null,null,null,null,null,"Informazione Diretta alla Pololazione"]
[null,"Modalità di comunicazione",null,null,null,null,null,null,null,null,"Cellulare / Radio"]
[null,"Equipaggiamento minimo consigliato ",null,null,null,null,null,null,null,null,"Vestiario alta visibilità EN471 – Impermeabile"]
[null,null,null,null,null,null,null,null,null,null,"Torcia elettrica"]
[null,null,null,null,null,null,null,null,null,null,"Megafono o altoparlante"]
[null,"Termine intervento",null,null,null,null,null,null,null,null,"Concordato con PCA / UCL - Alla cessata Emergenza"]
[null,"Contatti Utili",null,null,null,null,null,null,null,null,"Si faccia riferimento al PRONTUARIO DI EMERGENZA - CONTATTI"]
[]
[]
[]
[]
[]
[]
[]
[]
[]
[]
[]
[]
[]
[]
[]
[]
[]
[]
[]
[]
[]
[]
[]
[]
[]
[]
["Scheda Procedura",null,null,null,null,null,null,null,null,null,null,null,null,null,null,null,null,null,null,null,null,null,null,{"$f":"$X$4 &\".2\"","v":"IRD.3.2"}]
[]
[{"$f":"$A$6","v":"Rischio Incidente Domus Nova S.p.a."}]
[]
[]
[null,"Codice Scheda Scenario",null,null,null,null,null,null,null,null,{"$f":"UIRD.3","v":"IRD.3"}]
[null,"AZIONI DI SALVAGUARDIA - ATTIVAZIONE AREE DI EMERGENZA"]
[null,"Descrizione attività",null,null,null,null,null,null,null,null,"Consiste nel predisporre i materiali e le attrezzature necessarie all’accoglienza ed al ricovero della popolazione sfollata."]
[]
[null,"Personale coinvolto",null,null,null,null,null,null,null,null,{"$f":"$K$23","v":"- Polizia Locale"}]
[null,null,null,null,null,null,null,null,null,null,{"$f":"$K$24","v":"- Volontari P.C."}]
[null,null,null,null,null,null,null,null,null,null,{"$f":"$K$25","v":"- Tecnici/Operai Comunali"}]
[null,"Numero Operatori",null,null,null,null,null,null,null,null,"Una squadra"]
[null,"Automezzo dedicato",null,null,null,null,null,null,null,null,"Si"]
[null,"Azioni",null,null,null,null,null,null,null,null,"- Reperire, trasportare e posizionare i materiali presso le aree prescelte"]
[null,null,null,null,null,null,null,null,null,null,"- Organizzare un servizio di accoglienza registrazione e smistamento."]
[null,null,null,null,null,null,null,null,null,null,"- Verificare necessità di assistenza sanitaria ed eventualmente comunicarla all’UCL."]
[]
[null,null,null,null,null,null,null,null,null,null,"- Distribuire generi di prima necessità."]
[null,null,null,null,null,null,null,null,null,null,"- Fornire agli ospiti assistenza continua."]
[null,null,null,null,null,null,null,null,null,null,"- Fare periodico rapporto all’UCL."]
[null,"Ubicazione Aree di raccolta popolazione",null,null,null,null,null,null,null,null,{"$f":"$K$40","v":"In questa fase non è prevista l’attivazione di tali aree."}]
[null,null,null,null,null,null,null,null,null,null,{"$f":"K42","v":""}]
[null,null,null,null,null,null,null,null,null,null,{"$f":"K43","v":""}]
[null,null,null,null,null,null,null,null,null,null,{"$f":"K44","v":""}]
[null,"Aree di ricovero",null,null,null,null,null,null,null,null,{"$f":"K45","v":""}]
[null,null,null,null,null,null,null,null,null,null,{"$f":"IF(INDEX(MR3RIC,1,5)=\"\",\"\",\"- \"&VLOOKUP(INDEX(MR3RIC,1,5),Ricovero,2))","v":""}]
[null,null,null,null,null,null,null,null,null,null,{"$f":"IF(INDEX(MR3RIC,1,6)=\"\",\"\",\"- \"&VLOOKUP(INDEX(MR3RIC,1,6),Ricovero,2))","v":""}]
[null,null,null,null,null,null,null,null,null,null,{"$f":"K48","v":""}]
[null,"Modalità di comunicazione",null,null,null,null,null,null,null,null,"Cellulare / Radio"]
[null,"Equipaggiamento minimo consigliato ",null,null,null,null,null,null,null,null,"Brande/Cuscini/Materassi/Coperte"]
[null,null,null,null,null,null,null,null,null,null,"Generi di prima necessità (acqua, carta igienica, viveri, ecc.)"]
[null,"Procedure Operativa Standard (POS)",null,null,null,null,null,null,null,null,"Allestimento Area di Ricovero"]
[null,"Termine intervento",null,null,null,null,null,null,null,null,"Concordato con PCA / UCL - Alla cessata Emergenza"]
[null,"Contatti Utili",null,null,null,null,null,null,null,null,"Si faccia riferimento al PRONTUARIO DI EMERGENZA - CONTATTI"]
[]
[]
[]
[]
[]
[]
[]
[]
[]
[]
[]
[]
[]
[]
[]
[]
[]
[]
[]
[]
[]
[]
[]
[]
[]
["Scheda Procedura",null,null,null,null,null,null,null,null,null,null,null,null,null,null,null,null,null,null,null,null,null,null,{"$f":"$X$4 &\".3\"","v":"IRD.3.3"}]
[]
[{"$f":"$A$6","v":"Rischio Incidente Domus Nova S.p.a."}]
[]
[]
[null,"Codice Scheda Scenario",null,null,null,null,null,null,null,null,{"$f":"UIRD.3","v":"IRD.3"}]
[null,"AZIONI DI SALVAGUARDIA - EVACUAZIONE"]
[null,"Descrizione attività",null,null,null,null,null,null,null,null,"Consiste nella notifica dell’ordinanza di evacuazione e verifica dell’esecuzione."]
[]
[null,"Personale coinvolto",null,null,null,null,null,null,null,null,{"$f":"$K$23","v":"- Polizia Locale"}]
[null,null,null,null,null,null,null,null,null,null,{"$f":"$K$24","v":"- Volontari P.C."},null,null,null,"(Eventualmente Forze dell’Ordine)"]
[null,"Numero Operatori",null,null,null,null,null,null,null,null,"L'impiego di operatori comunali e l'eventuale numero necessario per l'operazione sono stabiliti dal PCA."]
[]
[null,"Automezzo dedicato",null,null,null,null,null,null,null,null,"Si (Se necessario)"]
[null,"Azioni",null,null,null,null,null,null,null,null,"- Comunicazione ad ogni unità abitativa dell’allarme in atto e della necessità di evacuazione. "]
[]
[null,null,null,null,null,null,null,null,null,null,"- Disposizioni per un corretto allontanamento."]
[null,null,null,null,null,null,null,null,null,null,"- Informazione circa l’ubicazione dell’Area di Accoglienza/Ricovero."]
[null,null,null,null,null,null,null,null,null,null,"- Comunicare all’UCL se le persone evacuate intendano usufruire dell’Area di Accoglienza/Ricovero o se provvedono da soli al proprio alloggiamento presso strutture private (alberghi, parenti, amici…); in tal caso comunicare anche un recapito telefonico per comunicazioni di urgenza."]
[]
[]
[]
[]
[null,null,null,null,null,null,null,null,null,null,"- Comunicare all’UCL il progressivo sgombero dei numeri civici interessati."]
[]
[null,null,null,null,null,null,null,null,null,null,"- Se possibile a evacuazione ultimata presidio e controllo delle aree disabitate."]
[]
[null,"Ubicazione intervento",null,null,null,null,null,null,null,null,"Zone colpite in accordo con il PCA."]
[null,"Modalità di comunicazione",null,null,null,null,null,null,null,null,"Cellulare / Radio"]
[null,"Equipaggiamento minimo consigliato ",null,null,null,null,null,null,null,null,"Vestiario alta visibilità EN471 – Impermeabile"]
[null,null,null,null,null,null,null,null,null,null,"Torcia elettrica"]
[null,null,null,null,null,null,null,null,null,null,"Copia della Ordinanza di Evacuazione"]
[null,null,null,null,null,null,null,null,null,null,"Copie Scheda M2 Tomo Giallo - Risorse"]
[null,"Procedure Operativa Standard (POS)",null,null,null,null,null,null,null,null,"Evacuazione Popolazione"]
[null,"Termine intervento",null,null,null,null,null,null,null,null,"Concordato con PCA / UCL - Alla cessata Emergenza"]
[null,"Contatti Utili",null,null,null,null,null,null,null,null,"Si faccia riferimento al PRONTUARIO DI EMERGENZA - CONTATTI"]
[]
[]
[]
[]
[]
[]
[]
[]
[]
[]
[]
[]
[]
[]
[]
[]
[]
[]
[]
[]
[]
[]
[]
[]
["Scheda Procedura",null,null,null,null,null,null,null,null,null,null,null,null,null,null,null,null,null,null,null,null,null,null,{"$f":"$X$4 &\".4\"","v":"IRD.3.4"}]
[]
[{"$f":"$A$6","v":"Rischio Incidente Domus Nova S.p.a."}]
[]
[]
[null,"Codice Scheda Scenario",null,null,null,null,null,null,null,null,{"$f":"UIRD.3","v":"IRD.3"}]
[null,"AZIONI DI SALVAGUARDIA - INFORMAZIONE ALLA POPOLAZIONE CESSATA EMERGENZA"]
[null,"Descrizione attività",null,null,null,null,null,null,null,null,"Informare la popolazione del cessato pericolo e del ritorno alla normalità. "]
[]
[null,"Personale coinvolto",null,null,null,null,null,null,null,null,{"$f":"$K$24","v":"- Volontari P.C."}]
[null,null,null,null,null,null,null,null,null,null,{"$f":"$K$23","v":"- Polizia Locale"}]
[null,"Numero Operatori",null,null,null,null,null,null,null,null,"Tre squadre composte da un agente di Polizia Locale ed un Volontario di P.C."]
[]
[null,"Automezzo dedicato",null,null,null,null,null,null,null,null,"Uno per ogni squadra"]
[null,"Azioni",null,null,null,null,null,null,null,null,"- Comunicare la cessazione dello stato di emergenza ed il ritorno alla normalità."]
[]
[null,null,null,null,null,null,null,null,null,null,"- Riportare le eventuali norme di comportamento che il PCA ha ritenuto di impartire per precauzione."]
[]
[null,null,null,null,null,null,null,null,null,null,"- Fare un periodico rapporto al PCA/UCL."]
[null,"Ubicazione Intervento",null,null,null,null,null,null,null,null,"Tutto il territorio comunale all'interno dei posti di blocco."]
[]
[null,"Procedure Operativa Standard (POS)",null,null,null,null,null,null,null,null,"Informazione Diretta alla Popolazione"]
[null,"Modalità di comunicazione",null,null,null,null,null,null,null,null,"Cellulare / Radio"]
[null,"Equipaggiamento minimo consigliato ",null,null,null,null,null,null,null,null,"Vestiario alta visibilità EN471 – Impermeabile"]
[null,null,null,null,null,null,null,null,null,null,"Torcia elettrica"]
[null,null,null,null,null,null,null,null,null,null,"Megafono o altoparlante"]
[null,"Termine intervento",null,null,null,null,null,null,null,null,"Concordato con PCA / UCL - Alla cessata Emergenza"]
[null,"Contatti Utili",null,null,null,null,null,null,null,null,"Si faccia riferimento al PRONTUARIO DI EMERGENZA - CONTATTI"]

{"sheet":"RIL_2","index":16,"n_rows":211,"n_cols":27,"rows_kept":211,"cut":false,"hidden":false,"merged":[[210,1,211,9],[210,10,211,24],[179,23,182,25],[181,0,182,22],[184,1,184,9],[184,10,184,24],[185,1,185,24],[186,1,191,9],[186,10,189,24],[202,1,202,9],[202,10,202,24],[203,1,207,9],[203,10,203,24],[204,10,205,24],[206,10,207,24],[208,1,208,9],[208,10,208,24],[209,1,209,9],[209,10,209,24],[195,1,195,9],[195,10,195,24],[196,1,196,9],[196,10,196,24],[197,1,201,9],[190,10,191,24],[192,1,194,9],[192,10,192,24],[193,10,193,24],[194,10,194,24],[197,10,198,24],[199,10,199,24],[200,10,200,24],[201,10,201,24],[179,0,180,22],[21,11,21,24],[22,11,22,24],[37,10,37,24],[23,1,25,9],[44,10,44,24],[26,1,29,9],[26,10,29,24],[30,1,32,9],[33,1,34,9],[33,10,34,24],[30,10,32,24],[35,1,37,9],[35,10,35,24],[36,10,36,24],[51,1,55,9],[51,10,55,24],[38,1,40,9],[38,10,38,24],[39,10,39,24],[40,10,40,24],[59,10,59,24],[57,1,59,9],[41,1,44,9],[0,0,1,6],[0,7,1,18],[0,19,1,25],[3,0,4,22],[3,23,6,25],[5,0,6,22],[17,10,17,24],[18,11,18,24],[20,11,20,24],[19,11,19,24],[10,1,13,9],[10,10,13,24],[14,1,16,9],[17,1,22,9],[14,10,16,24],[8,1,8,9],[8,10,8,24],[9,1,9,9],[9,10,9,24],[41,10,41,24],[42,10,42,24],[43,10,43,24],[69,19,70,22],[69,23,70,25],[45,1,47,9],[45,10,47,24],[48,1,50,9],[48,11,48,24],[49,11,49,24],[50,11,50,24],[57,10,57,24],[56,1,56,9],[56,10,56,24],[63,0,64,22],[63,23,66,25],[65,0,66,22],[68,0,70,4],[68,5,70,10],[68,11,68,25],[69,11,70,14],[69,15,70,18],[58,10,58,24],[71,0,71,4],[71,5,71,10],[71,11,71,14],[71,15,71,18],[71,19,71,22],[71,23,71,25],[72,0,73,4],[72,5,73,10],[72,11,73,14],[72,15,73,18],[72,19,73,22],[72,23,73,25],[72,26,80,26],[74,0,76,4],[74,5,76,10],[74,11,74,14],[74,15,76,18],[74,19,76,22],[75,11,75,14],[76,11,76,14],[80,15,80,18],[80,19,80,22],[80,23,80,25],[79,23,79,25],[80,0,80,4],[80,5,80,10],[80,11,80,14],[79,0,79,4],[79,5,79,10],[79,11,79,14],[79,15,79,18],[79,19,79,22],[77,0,78,4],[77,5,78,10],[77,11,78,14],[77,19,78,22],[81,0,82,4],[81,5,82,10],[81,11,82,14],[81,15,82,18],[81,19,82,22],[81,23,82,25],[84,0,87,4],[84,5,87,10],[84,11,84,14],[84,15,84,18],[84,19,87,22],[84,23,87,25],[83,0,83,4],[83,5,83,10],[83,11,83,14],[83,15,83,18],[83,19,83,22],[83,23,83,25],[89,11,91,14],[89,15,91,18],[89,19,89,22],[89,23,91,25],[90,19,90,22],[91,19,91,22],[95,19,95,22],[84,26,87,26],[85,11,85,14],[85,15,85,18],[86,11,86,14],[86,15,86,18],[87,11,87,14],[87,15,87,18],[88,0,88,25],[89,0,91,4],[145,1,149,9],[149,11,149,24],[119,0,120,22],[119,23,122,25],[121,0,122,22],[124,1,124,9],[124,10,124,24],[132,1,132,24],[126,1,131,9],[126,10,128,24],[129,10,131,24],[125,1,125,24],[143,10,144,24],[140,1,140,9],[141,1,144,9],[141,10,141,24],[140,10,140,24],[145,11,145,24],[146,11,146,24],[136,1,136,9],[133,10,133,24],[134,10,134,24],[77,15,78,18],[75,23,75,24],[133,1,135,9],[97,0,100,4],[97,5,100,10],[92,0,92,25],[93,0,95,4],[93,5,95,10],[93,11,95,14],[93,15,95,18],[93,19,93,22],[93,23,95,25],[94,19,94,22],[97,11,100,14],[97,15,100,18],[97,19,100,22],[97,23,100,25],[96,0,96,4],[96,5,96,10],[96,11,96,14],[96,15,96,18],[96,19,96,22],[96,23,96,25],[89,5,91,10],[171,10,171,24],[172,10,172,24],[160,10,160,24],[161,1,161,9],[161,10,161,24],[135,10,135,24],[136,10,136,24],[137,10,137,24],[138,1,139,9],[138,10,138,24],[139,10,139,24],[137,1,137,9],[162,1,166,9],[162,10,162,24],[163,10,163,24],[164,10,164,24],[165,10,166,24],[154,1,156,9],[158,1,158,9],[158,10,158,24],[159,1,160,9],[159,10,159,24],[147,11,147,24],[148,11,148,24],[23,17,25,24],[23,10,23,16],[24,10,24,16],[25,10,25,16],[102,0,102,25],[142,10,142,24],[174,1,175,9],[174,10,175,24],[167,10,168,24],[151,1,152,9],[151,10,152,24],[150,1,150,9],[153,1,153,24],[157,1,157,9],[157,10,157,24],[150,10,150,24],[169,10,169,24],[170,10,170,24],[154,10,154,24],[155,10,155,24],[156,10,156,24],[173,1,173,9],[173,10,173,24],[167,1,172,9]]}
[{"$f":"NCOM&\" (\"&PCOM&\")\"","v":"Comune di Trescore Cremasco (CR)"},null,null,null,null,null,null,{"$f":"IF(INDEX(INT,1,13)=\"\",INDEX(INT,1,1),INDEX(INT,1,13))","v":"Piano di Emergenza Intercomunale di Protezione Civile"},null,null,null,null,null,null,null,null,null,null,null,{"$f":"IF(TIPOP=\"Edizione\",\"Ed. \",IF(TIPOP=\"Revisione\",\"Rev. \",\"Bozza \"))&TIPON&\" del \"&TIPOD","v":"Ed. 01 del 04/11/2012"}]
[]
[]
["Scheda Scenario",null,null,null,null,null,null,null,null,null,null,null,null,null,null,null,null,null,null,null,null,null,null,{"$f":"_RSS4","v":"RIL.2"}]
[]
[{"$f":"IF(INDEX(RSS4PAR,1,19)=\"\",INDEX(RSS4PAR,1,12),INDEX(RSS4PAR,1,19))&\" - Fase di Allerta Codice 2\"","v":" - Fase di Allerta Codice 2"}]
[]
[]
[null,"Paragrafi di Riferimento ",null,null,null,null,null,null,null,null,{"$f":"INDEX(RSS4PAR,1,1)&INDEX(RSS4PAR,1,12)","v":""}]
[null,"Codice Scheda",null,null,null,null,null,null,null,null,{"$f":"X4","v":"RIL.2"}]
[null,"Evento atteso",null,null,null,null,null,null,null,null,"Esondazione di acque dal corso del Fiume Lambro dovute a portate non contenibili nell'alveo a seguito di precipitazioni di eccezionale entità o dovute a cedimento di argini o a ostruzioni delle luci dei ponti."]
[]
[]
[]
[null,"Attività U.C.L.",null,null,null,null,null,null,null,null,"Attivazione Servizio di Allerta con finalità di monitoraggio dell'evolversi del fenomeno lungo l'asta del Fiume Lambro."]
[]
[]
[null,"Ubicazione intervento",null,null,null,null,null,null,null,null,"I punti da sottoporre a monitoraggio sono i seguenti:"]
[null,null,null,null,null,null,null,null,null,null,{"$f":"[1]Maschera!BR11","v":0},{"$f":"[1]Maschera!BT11","v":0}]
[null,null,null,null,null,null,null,null,null,null,{"$f":"[1]Maschera!BR12","v":0},{"$f":"[1]Maschera!BT12","v":0}]
[null,null,null,null,null,null,null,null,null,null,{"$f":"[1]Maschera!BR13","v":0},{"$f":"[1]Maschera!BT13","v":0}]
[null,null,null,null,null,null,null,null,null,null,{"$f":"[1]Maschera!BR14","v":0},{"$f":"[1]Maschera!BT14","v":0}]
[null,null,null,null,null,null,null,null,null,null,{"$f":"[1]Maschera!BR15","v":0},{"$f":"[1]Maschera!BT15","v":0}]
[null,"Personale mobilitato",null,null,null,null,null,null,null,null,{"$f":"IF(INDEX(RSS4PER,1,1)=\"\",\"\",\"- \"&VLOOKUP(INDEX(RSS4PER,1,1),Personale,IF(INDEX(Personale,INDEX(RSS4PER,1,1),14)=\"\",2,14)))","v":"- Polizia Locale"},null,null,null,null,null,null,"Riportare la composizione delle squadre nel Modulo M1"]
[null,null,null,null,null,null,null,null,null,null,{"$f":"IF(INDEX(RSS4PER,1,2)=\"\",\"\",\"- \"&VLOOKUP(INDEX(RSS4PER,1,2),Personale,IF(INDEX(Personale,INDEX(RSS4PER,1,2),14)=\"\",2,14)))","v":"- Volontari P.C."}]
[null,null,null,null,null,null,null,null,null,null,{"$f":"IF(INDEX(RSS4PER,1,3)=\"\",\"\",\"- \"&VLOOKUP(INDEX(RSS4PER,1,3),Personale,IF(INDEX(Personale,INDEX(RSS4PER,1,3),14)=\"\",2,14)))","v":"- Tecnici/Operai Comunali"}]
[null,"Attività personale mobilitato",null,null,null,null,null,null,null,null,"Il servizio di Allerta si occupa del Monitoraggio dell’evolversi del fenomeno sotto forma di presidio costante dei punti sopra elencati e della perlustrazione delle aree tra essi comprese comprese. "]
[]
[]
[]
[null,"Grado di coinvolgimento della popolazione",null,null,null,null,null,null,null,null,"In questa fase dell'emergenza la popolazione non risulta coinvolta direttamente. E' importante comunque rendere nota la natura del rischio in corso e degli interventi messi in pratica."]
[]
[]
[null,"Cancelli e vie alternative",null,null,null,null,null,null,null,null,"Non sono previsti in questa fase dell'emergenza."]
[]
[null,"Aree di raccolta popolazione",null,null,null,null,null,null,null,null,{"$f":"IF(INDEX(RSS4RIC,1,1)=\"\",\"In questa fase non è prevista l’attivazione di tali aree.\",\"Per questa emergenza \"&IF(INDEX(RSS4RIC,1,2)=\"\",\"è disponibile la seguente area:\",\"sono disponibili le seguenti aree:\"))","v":"In questa fase non è prevista l’attivazione di tali aree."}]
[null,null,null,null,null,null,null,null,null,null,{"$f":"IF(INDEX(RSS4RIC,1,1)=\"\",\"\",\"- \"&VLOOKUP(INDEX(RSS4RIC,1,1),Ricovero,2))","v":""}]
[null,null,null,null,null,null,null,null,null,null,{"$f":"IF(INDEX(RSS4RIC,1,2)=\"\",\"\",\"- \"&VLOOKUP(INDEX(RSS4RIC,1,2),Ricovero,2))","v":""}]
[null,"Area di ricovero",null,null,null,null,null,null,null,null,{"$f":"IF(INDEX(RSS4RIC,1,3)=\"\",\"\",\"- \"&VLOOKUP(INDEX(RSS4RIC,1,3),Ricovero,2))","v":""}]
[null,null,null,null,null,null,null,null,null,null,{"$f":"IF(INDEX(RSS4RIC,1,4)=\"\",\"\",\"- \"&VLOOKUP(INDEX(RSS4RIC,1,4),Ricovero,2))","v":""}]
[null,null,null,null,null,null,null,null,null,null,{"$f":"IF(K38=\"\",\"\",\"In funzione della gravità della situazione si decide quali/quante aree attivare.\")","v":""}]
[null,"Area di raduno soccorritori",null,null,null,null,null,null,null,null,{"$f":"IF(INDEX(RSS4SOC,1,1)=\"\",\"In questa fase non è prevista l’attivazione di tali aree.\",\"Per questa emergenza \"&IF(INDEX(RSS4SOC,1,2)=\"\",\"è disponibile la seguente area:\",\"sono disponibili le seguenti aree:\"))","v":"In questa fase non è prevista l’attivazione di tali aree."}]
[null,null,null,null,null,null,null,null,null,null,{"$f":"IF(INDEX(RSS4SOC,1,1)=\"\",\"\",\"- \"&VLOOKUP(INDEX(RSS4SOC,1,1),Soccorritori,2))","v":""}]
[null,null,null,null,null,null,null,null,null,null,{"$f":"IF(INDEX(RSS4SOC,1,2)=\"\",\"\",\"- \"&VLOOKUP(INDEX(RSS4SOC,1,2),Soccorritori,2))","v":""}]
[null,null,null,null,null,null,null,null,null,null,{"$f":"IF(K43=\"\",\"\",\"In funzione della gravità della situazione si decide quali/quante aree attivare.\")","v":""}]
[null,"Ordinanze Necessarie",null,null,null,null,null,null,null,null,"Nessuna."]
[]
[]
[null,"Modalità Riunione U.C.L.",null,null,null,null,null,null,null,null,"X","Non necessaria"]
[null,null,null,null,null,null,null,null,null,null,null,"Virtuale"]
[null,null,null,null,null,null,null,null,null,null,null,"In sede"]
[null,"Possibili Scenari Concomitanti",null,null,null,null,null,null,null,null,"Non ragionevolmente prevedibile la concomitanza con altri eventi."]
[]
[]
[]
[]
[null,"Contatti Utili",null,null,null,null,null,null,null,null,{"$f":"\"Consultare il \"&IF([1]Maschera!Z71=\"\",[1]Maschera!N71,[1]Maschera!Z71)","v":"Consultare il Tomo Giallo - Risorse"}]
[null,"Cartografia",null,null,null,null,null,null,null,null,{"$f":"INDEX(RSS4PAR,1,28)","v":0}]
[null,null,null,null,null,null,null,null,null,null,{"$f":"INDEX(RSS4PAR,1,39)","v":0}]
[null,null,null,null,null,null,null,null,null,null,{"$f":"INDEX(RSS4PAR,1,50)","v":0}]
[]
[]
[]
[{"$f":"Titolo2","v":"Procedure U.C.L."},null,null,null,null,null,null,null,null,null,null,null,null,null,null,null,null,null,null,null,null,null,null,{"$f":"X4","v":"RIL.2"}]
[]
[{"$f":"$A$6","v":" - Fase di Allerta Codice 2"}]
[]
[]
["RESPONSABILE",null,null,null,null,"AZIONE",null,null,null,null,null,"CHIAMATE"]
[null,null,null,null,null,null,null,null,null,null,null,"MEMBRO UCL",null,null,null,"OPERATIVI",null,null,null,"ENTE INTERESSATO",null,null,null,"SCHEDE CHIAMATE"]
[]
[{"$f":"IF(INDEX(Sindaco,1,9)=\"\",INDEX(Sindaco,1,1),INDEX(Sindaco,1,9))","v":"SINDACO / R.O.C."},null,null,null,null,"Avvisa della Fase di Allerta Codice 2.",null,null,null,null,null,"- Sindaco",null,null,null,"--",null,null,null,"--",null,null,null,"O1 - O2"]
[{"$f":"IF(INDEX(Sindaco,1,9)=\"\",INDEX(Sindaco,1,1),INDEX(Sindaco,1,9))","v":"SINDACO / R.O.C."},null,null,null,null,{"$f":"\"Avvisa della Fase di Allerta Codice 2 e attiva il Servizio di Allerta. \"&_RSS4&\".1\"","v":"Avvisa della Fase di Allerta Codice 2 e attiva il Servizio di Allerta. RIL.2.1"},null,null,null,null,null,"- Tutti",null,null,null,"--",null,null,null,"--",null,null,null,"O1 - O2",null,null,{"$f":"_RSS4&\".1\"","v":"RIL.2.1"}]
[]
[{"$f":"IF(INDEX(PL,1,9)=\"\",INDEX(PL,1,1),INDEX(PL,1,9))","v":"POLIZIA LOCALE"},null,null,null,null,{"$f":"\"Responsabile \"&_RSS4&\".1\"","v":"Responsabile RIL.2.1"},null,null,null,null,null,{"$f":"\"- \"&PROPER(IF(INDEX(RT,1,9)=\"\",INDEX(RT,1,1),INDEX(RT,1,9)))","v":"- Resp. Territorio"},null,null,null,{"$f":"\"- \"&IF(INDEX(PLO,1,9)=\"\",INDEX(PLO,1,1),INDEX(PLO,1,9))","v":"- Agenti P.L."},null,null,null,"--"]
[null,null,null,null,null,null,null,null,null,null,null,{"$f":"\"- \"&PROPER(IF(INDEX(CV,1,9)=\"\",INDEX(CV,1,1),INDEX(CV,1,9)))","v":"- C. Volontariato"},null,null,null,null,null,null,null,null,null,null,null,"O1 - O2",null,"A2.2"]
[null,null,null,null,null,null,null,null,null,null,null,{"$f":"\"- \"&PROPER(IF(INDEX(CC,1,9)=\"\",INDEX(CC,1,1),INDEX(CC,1,9)))","v":"- C. Carabinieri"}]
[{"$f":"IF(INDEX(RT,1,9)=\"\",INDEX(RT,1,1),INDEX(RT,1,9))","v":"RESP. TERRITORIO"},null,null,null,null,{"$f":"\"Responsabile \"&_RSS4&\".1\"","v":"Responsabile RIL.2.1"},null,null,null,null,null,"--",null,null,null,{"$f":"\"- \"&IF(INDEX(TCO,1,9)=\"\",INDEX(TCO,1,1),INDEX(TCO,1,9))","v":"- Tecnici Comunali"},null,null,null,"--",null,null,null,"A2.1","A4","A5"]
[null,null,null,null,null,null,null,null,null,null,null,null,null,null,null,null,null,null,null,null,null,null,null,"B2","B4","C1"]
[{"$f":"IF(INDEX(CV,1,9)=\"\",INDEX(CV,1,1),INDEX(CV,1,9))","v":"C. VOLONTARIATO"},null,null,null,null,{"$f":"\"Coadiuva \"&_RSS4&\".1\"","v":"Coadiuva RIL.2.1"},null,null,null,null,null,"--",null,null,null,{"$f":"\"- \"&IF(INDEX(VO,1,9)=\"\",INDEX(VO,1,1),INDEX(VO,1,9))","v":"- Gruppi Volontari"},null,null,null,"--",null,null,null,"A3 - B3"]
[{"$f":"IF(INDEX(CC,1,9)=\"\",INDEX(CC,1,1),INDEX(CC,1,9))","v":"C. CARABINIERI"},null,null,null,null,{"$f":"\"Coadiuva \"&_RSS4&\".1\"","v":"Coadiuva RIL.2.1"},null,null,null,null,null,"--",null,null,null,{"$f":"\"- \"&IF(INDEX(CO,1,9)=\"\",INDEX(CO,1,1),INDEX(CO,1,9))","v":"- Carabinieri"},null,null,null,"--",null,null,null,"--"]
[{"$f":"IF(INDEX(PL,1,9)=\"\",INDEX(PL,1,1),INDEX(PL,1,9))","v":"POLIZIA LOCALE"},null,null,null,null,"Riferisce le informazioni raccolte dal Servizio di Allerta.",null,null,null,null,null,{"$f":"\"- \"&PROPER(IF(INDEX(ROC,1,9)=\"\",INDEX(ROC,1,1),INDEX(ROC,1,9)))","v":"- R.O.C."},null,null,null,"--",null,null,null,"--",null,null,null,"O1 - O2"]
[]
[{"$f":"IF(INDEX(ROC,1,9)=\"\",INDEX(ROC,1,1),INDEX(ROC,1,9))","v":"R.O.C."},null,null,null,null,"Informa periodicamente sulla situazione.",null,null,null,null,null,"- Sindaco",null,null,null,"--",null,null,null,"--",null,null,null,"O1 - O2"]
[{"$f":"IF(INDEX(ROC,1,9)=\"\",INDEX(ROC,1,1),INDEX(ROC,1,9))","v":"R.O.C."},null,null,null,null,{"$f":"\"A ragion veduta reitera la procedura \"&_RSS4&\".1\"","v":"A ragion veduta reitera la procedura RIL.2.1"},null,null,null,null,null,{"$f":"\"- \"&PROPER(IF(INDEX(RT,1,9)=\"\",INDEX(RT,1,1),INDEX(RT,1,9)))","v":"- Resp. Territorio"},null,null,null,{"$f":"\"- \"&IF(INDEX(PLO,1,9)=\"\",INDEX(PLO,1,1),INDEX(PLO,1,9))","v":"- Agenti P.L."},null,null,null,"--",null,null,null,"O1 - O2",null,null,{"$f":"_RSS4&\".1\"","v":"RIL.2.1"}]
[null,null,null,null,null,null,null,null,null,null,null,{"$f":"\"- \"&PROPER(IF(INDEX(CV,1,9)=\"\",INDEX(CV,1,1),INDEX(CV,1,9)))","v":"- C. Volontariato"},null,null,null,{"$f":"\"- \"&IF(INDEX(TCO,1,9)=\"\",INDEX(TCO,1,1),INDEX(TCO,1,9))","v":"- Tecnici Comunali"}]
[null,null,null,null,null,null,null,null,null,null,null,{"$f":"\"- \"&PROPER(IF(INDEX(CC,1,9)=\"\",INDEX(CC,1,1),INDEX(CC,1,9)))","v":"- C. Carabinieri"},null,null,null,{"$f":"\"- \"&IF(INDEX(VO,1,9)=\"\",INDEX(VO,1,1),INDEX(VO,1,9))","v":"- Gruppi Volontari"}]
[null,null,null,null,null,null,null,null,null,null,null,{"$f":"\"- \"&PROPER(IF(INDEX(PL,1,9)=\"\",INDEX(PL,1,1),INDEX(PL,1,9)))","v":"- Polizia Locale"},null,null,null,{"$f":"\"- \"&IF(INDEX(CO,1,9)=\"\",INDEX(CO,1,1),INDEX(CO,1,9))","v":"- Carabinieri"}]
["VERIFICA POSITIVA O EMANAZIONE DI AVVISO DI CRITICITA’ ELEVATA"]
[{"$f":"IF(INDEX(Sindaco,1,9)=\"\",INDEX(Sindaco,1,1),INDEX(Sindaco,1,9))","v":"SINDACO / R.O.C."},null,null,null,null,"Avvisa della Fase di Allerta Codice 3.",null,null,null,null,null,"--",null,null,null,"--",null,null,null,{"$f":"\"- \"&IF(INDEX(PR,1,9)=\"\",INDEX(PR,1,1),INDEX(PR,1,9))","v":"- Prefettura"},null,null,null,"C2.1 - C2.3 C2.4"]
[null,null,null,null,null,null,null,null,null,null,null,null,null,null,null,null,null,null,null,{"$f":"\"- \"&IF(INDEX(PRO,1,9)=\"\",INDEX(PRO,1,1),INDEX(PRO,1,9))","v":"- Provincia"}]
[null,null,null,null,null,null,null,null,null,null,null,null,null,null,null,null,null,null,null,{"$f":"\"- \"&IF(INDEX(REG,1,9)=\"\",INDEX(REG,1,1),INDEX(REG,1,9))","v":"- Regione"}]
["VERIFICA NEGATIVA E/O REVOCA DELL’AVVISO DI CRITICITA’ MODERATO"]
[{"$f":"IF(INDEX(Sindaco,1,9)=\"\",INDEX(Sindaco,1,1),INDEX(Sindaco,1,9))","v":"SINDACO / R.O.C."},null,null,null,null,"Avvisa della cessazione della Fase di  Allerta Codice 2.",null,null,null,null,null,"--",null,null,null,"--",null,null,null,{"$f":"\"- \"&IF(INDEX(PR,1,9)=\"\",INDEX(PR,1,1),INDEX(PR,1,9))","v":"- Prefettura"},null,null,null,"C2.1  C2.4"]
[null,null,null,null,null,null,null,null,null,null,null,null,null,null,null,null,null,null,null,{"$f":"\"- \"&IF(INDEX(PRO,1,9)=\"\",INDEX(PRO,1,1),INDEX(PRO,1,9))","v":"- Provincia"}]
[null,null,null,null,null,null,null,null,null,null,null,null,null,null,null,null,null,null,null,{"$f":"\"- \"&IF(INDEX(REG,1,9)=\"\",INDEX(REG,1,1),INDEX(REG,1,9))","v":"- Regione"}]
[{"$f":"IF(INDEX(Sindaco,1,9)=\"\",INDEX(Sindaco,1,1),INDEX(Sindaco,1,9))","v":"SINDACO / R.O.C."},null,null,null,null,"Avvisa della Cessato Allerta Codice 2.",null,null,null,null,null,"- Tutti",null,null,null,"--",null,null,null,"--",null,null,null,"O1 - O2"]
[{"$f":"IF(INDEX(PL,1,9)=\"\",INDEX(PL,1,1),INDEX(PL,1,9))","v":"POLIZIA LOCALE"},null,null,null,null,"Se informato della Cessato Allerta Codice 2 dispone il rientro delle squadre.",null,null,null,null,null,"--",null,null,null,{"$f":"\"- \"&IF(INDEX(SC,1,9)=\"\",INDEX(SC,1,1),INDEX(SC,1,9))","v":"- Squadre Operativi"},null,null,null,"--",null,null,null,"M1"]
[]
[]
[]
[]
["PER LE COMUNICAZIONI EVIDENZIATE IN ROSSO UTILIZZARE IL MODULO FAX M4"]
[]
[]
[]
[]
[]
[]
[]
[]
[]
[]
[]
[]
[]
[]
[]
[]
[{"$f":"Titolo3","v":"Scheda Procedura Operativa"},null,null,null,null,null,null,null,null,null,null,null,null,null,null,null,null,null,null,null,null,null,null,{"$f":"X4&\".1\"","v":"RIL.2.1"}]
[]
[{"$f":"$A$6","v":" - Fase di Allerta Codice 2"}]
[]
[]
[null,"Codice Scheda Scenario",null,null,null,null,null,null,null,null,{"$f":"X4","v":"RIL.2"}]
[null,"SERVIZIO DI ALLERTA"]
[null,"Descrizione Attività",null,null,null,null,null,null,null,null,"Durante la Fase di Allerta Codice 2 consiste nel presidio non continuativo delle Postazioni di Monitoraggio e nella perlustrazione delle altre zone sensibili ad intervalli stabiliti dall'UCL."]
[]
[]
[null,null,null,null,null,null,null,null,null,null,"A Fase di Allerta Codice 3 attivata il presidio delle Postazioni di Monitoraggio diventa continuativo e si incrementa la frequenza delle perlustrazioni del territorio."]
[]
[]
[null,"MONITORAGGIO"]
[null,"Personale Coinvolto",null,null,null,null,null,null,null,null,"Polizia Locale"]
[null,null,null,null,null,null,null,null,null,null,"Volontari P.C."]
[null,null,null,null,null,null,null,null,null,null,"Tecnici/Operai Comunali"]
[null,"Numero Operatori Consigliato",null,null,null,null,null,null,null,null,"Minimo 2 "]
[null,"Automezzo dedicato",null,null,null,null,null,null,null,null,"Non necessario"]
[null,"Equipaggiamento minimo consigliato ",null,null,null,null,null,null,null,null,"Vestiario alta visibilità EN471 - Impermeabile"]
[null,null,null,null,null,null,null,null,null,null,"Torcia elettrica"]
[null,"Modalità di comunicazione",null,null,null,null,null,null,null,null,"Cellulare / Radio"]
[null,"Azioni",null,null,null,null,null,null,null,null,"Osservare l’evoluzione dell’evento."]
[null,null,null,null,null,null,null,null,null,null,"Fare rapporti all’UCL ad intervalli regolari."]
[null,null,null,null,null,null,null,null,null,null,"Informare la popolazione con cui si dovesse interagire su quanto sta accadendo seguendo le istruzioni dell'UCL."]
[]
[null,"Ubicazione Postazioni di Monitoraggio",null,null,null,null,null,null,null,null,{"$f":"K19","v":0},0]
[null,null,null,null,null,null,null,null,null,null,0,0]
[null,null,null,null,null,null,null,null,null,null,0,0]
[null,null,null,null,null,null,null,null,null,null,0,0]
[null,null,null,null,null,null,null,null,null,null,0,0]
[null,"Termine intervento",null,null,null,null,null,null,null,null,"Concordato con UCL - Alla fine della fase di emergenza."]
[null,"Contatti Utili",null,null,null,null,null,null,null,null,"Si faccia riferimento al PRONTUARIO DI EMERGENZA - CONTATTI"]
[]
[null,"PERLUSTRAZIONE"]
[null,"Personale Coinvolto",null,null,null,null,null,null,null,null,"Polizia Locale"]
[null,null,null,null,null,null,null,null,null,null,"Volontari P.C."]
[null,null,null,null,null,null,null,null,null,null,"Tecnici/Operai Comunali"]
[null,"Numero Operatori Consigliato",null,null,null,null,null,null,null,null,"Minimo 2 "]
[null,"Automezzo dedicato",null,null,null,null,null,null,null,null,"Si"]
[null,"Equipaggiamento minimo consigliato ",null,null,null,null,null,null,null,null,"Vestiario alta visibilità EN471 - Impermeabile"]
[null,null,null,null,null,null,null,null,null,null,"Torcia elettrica"]
[null,"Modalità di comunicazione",null,null,null,null,null,null,null,null,"Cellulare / Radio"]
[null,"Azioni",null,null,null,null,null,null,null,null,"Osservare l’evoluzione dell’evento."]
[null,null,null,null,null,null,null,null,null,null,"Fare rapporti all'UCL ad intervalli regolari sulla posizione della pattuglia."]
[null,null,null,null,null,null,null,null,null,null,"Comunicare all'UCL lo stato delle aree a rischio raggiunte."]
[null,null,null,null,null,null,null,null,null,null,"Informare la popolazione con cui si dovesse interagire su quanto sta accadendo seguendo le istruzioni dell'UCL."]
[]
[null,"Ubicazione Intervento",null,null,null,null,null,null,null,null,"Deve essere condotta lungo i tratti di territorio compresi tra i punti di monitoraggio identificati in precedenza, in particolare:"]
[]
[null,null,null,null,null,null,null,null,null,null,"- Da Post. 1 a Post. 2 lungo via Regina Margherita in auto"]
[null,null,null,null,null,null,null,null,null,null,"- Da Post. 2 a Post. 3 lungo via Regina Margherita in auto"]
[null,null,null,null,null,null,null,null,null,null,"- Da Post. 3 a Post. 4 lungo lungo sommità argine a piedi "]
[null,null,null,null,null,null,null,null,null,null,"- Da Post. 4 a Post. 5 lungo via Osculati e via Regina Margherita in auto"]
[null,"Termine intervento",null,null,null,null,null,null,null,null,"Concordato con UCL - Alla fine della fase di emergenza."]
[null,"Contatti Utili",null,null,null,null,null,null,null,null,"Si faccia riferimento al PRONTUARIO DI EMERGENZA - CONTATTI"]
[]
[]
[]
[]
[{"$f":"Titolo3","v":"Scheda Procedura Operativa"},null,null,null,null,null,null,null,null,null,null,null,null,null,null,null,null,null,null,null,null,null,null,{"$f":"X64&\".1\"","v":"RIL.2.1"}]
[]
[{"$f":"$A$6","v":" - Fase di Allerta Codice 2"}]
[]
[]
[null,"Codice Scheda Scenario",null,null,null,null,null,null,null,null,{"$f":"K125","v":"RIL.2"}]
[null,"RIMOZIONE OSTACOLI DA ALVEO"]
[null,"Descrizione attività",null,null,null,null,null,null,null,null,"Rimuovere ostacoli di diverso genere (alberi, automobili, passerelle pedonali crollate, oggetti abbandonati di dimensioni rilevanti, ecc. )  che possano compromettere il normale deflusso dell'acqua nell'alveo o che ostruiscano parzialmente la luce di un attraversamento. "]
[]
[]
[]
[null,null,null,null,null,null,null,null,null,null,"Oltre alla rimozione si prevede, se tecnicamente possibile, la definitiva messa in sicurezza dell’area.  "]
[]
[null,"Personale Coinvolto",null,null,null,null,null,null,null,null,"Polizia Locale"]
[null,null,null,null,null,null,null,null,null,null,"Volontari P.C."]
[null,null,null,null,null,null,null,null,null,null,"Tecnici/Operai Comunali"]
[null,"Numero Operatori Consigliato",null,null,null,null,null,null,null,null,"Almeno una squadra"]
[null,"Automezzo dedicato",null,null,null,null,null,null,null,null,"Si"]
[null,"Equipaggiamento minimo consigliato ",null,null,null,null,null,null,null,null,"Vestiario alta visibilità EN471 - Impermeabile - DPI antitaglio - Imbragatura o Dispositivi di Protezione Anticaduta"]
[]
[null,null,null,null,null,null,null,null,null,null,"Attrezzatura: badili, picconi, rastri , roncole, motosega, decespugliatori \n"]
[null,null,null,null,null,null,null,null,null,null,"Attrezzature speciali: se necessarie idonee macchine d'opera."]
[null,null,null,null,null,null,null,null,null,null,"Materiali di consumo: transenne e segnali"]
[null,"Modalità di comunicazione",null,null,null,null,null,null,null,null,"Cellulare / Radio"]
[null,"Azioni",null,null,null,null,null,null,null,null,"Perimetrare l’area, inibirne l’accesso e verificarne la sicurezza."]
[null,null,null,null,null,null,null,null,null,null,"Rimuovere l’ostacolo direttamente e/o verificare se necessario con UCL l’invio di macchinari specifici."]
[]
[null,null,null,null,null,null,null,null,null,null,"Fare rapporti all’UCL ad intervalli regolari descrivendo lo stato dell’avanzamento dei lavori."]
[]
[null,"Ubicazione Intervento",null,null,null,null,null,null,null,null,"In accordo con il PE o dove stabilito dall'UCL."]
[null,"Termine intervento",null,null,null,null,null,null,null,null,"Concordato con UCL - Alla fine della fase di emergenza."]
[null,"Contatti Utili",null,null,null,null,null,null,null,null,"Si faccia riferimento al PRONTUARIO DI EMERGENZA - CONTATTI"]

{"sheet":"RIL_3","index":17,"n_rows":283,"n_cols":27,"rows_kept":283,"cut":false,"hidden":false,"merged":[[133,10,133,24],[158,10,158,24],[137,10,137,24],[135,1,135,9],[141,10,141,24],[136,10,136,24],[177,10,177,24],[161,10,161,24],[162,10,162,24],[163,10,163,24],[145,17,145,24],[151,10,152,16],[151,17,152,24],[170,10,170,24],[171,1,171,9],[177,1,178,9],[142,1,154,9],[153,10,154,24],[172,1,176,9],[174,10,174,24],[166,10,166,24],[176,10,176,24],[142,10,143,24],[137,1,141,9],[49,10,49,24],[50,1,52,9],[50,11,50,24],[51,11,51,24],[52,11,52,24],[41,1,42,9],[48,1,49,9],[42,10,42,24],[44,10,44,24],[47,10,47,24],[43,1,47,9],[45,10,45,24],[74,23,76,25],[75,0,76,4],[73,19,73,22],[74,0,74,4],[74,5,76,10],[74,11,76,14],[74,15,76,18],[74,19,76,22],[87,0,88,4],[77,23,80,25],[78,19,78,22],[79,19,79,22],[80,19,80,22],[81,0,86,4],[81,5,86,10],[81,15,86,18],[81,23,86,25],[77,0,80,4],[77,5,80,10],[77,11,80,14],[77,15,80,18],[87,5,88,10],[87,11,87,14],[87,15,88,18],[0,0,1,6],[0,7,1,18],[0,19,1,25],[3,0,4,22],[3,23,6,25],[37,1,40,9],[5,0,6,22],[14,10,18,24],[14,1,18,9],[36,10,36,24],[37,10,37,24],[9,1,9,9],[8,10,8,24],[10,10,13,24],[24,1,26,9],[24,10,26,24],[9,10,9,24],[10,1,13,9],[40,10,40,24],[8,1,8,9],[19,1,20,9],[19,10,20,24],[21,1,23,9],[27,10,28,24],[27,1,29,9],[29,10,29,24],[58,10,58,24],[57,1,57,9],[57,10,57,24],[53,10,56,24],[53,1,56,9],[68,5,70,10],[68,11,68,25],[69,23,70,25],[63,23,66,25],[63,0,64,22],[39,10,39,24],[41,10,41,24],[43,10,43,24],[34,10,34,24],[30,1,36,9],[30,10,32,24],[38,10,38,24],[33,10,33,24],[35,10,35,24],[46,10,46,24],[58,1,60,9],[48,10,48,24],[72,19,72,22],[65,0,66,22],[71,0,73,4],[71,5,73,10],[71,11,73,14],[71,15,73,18],[71,19,71,22],[69,11,70,14],[69,15,70,18],[69,19,70,22],[68,0,70,4],[71,23,71,25],[59,10,59,24],[60,10,60,24],[77,19,77,22],[91,0,93,4],[91,5,93,10],[91,11,91,14],[91,15,93,18],[91,19,93,22],[91,23,93,25],[92,11,92,14],[93,11,93,14],[89,23,89,25],[90,0,90,4],[90,5,90,10],[90,11,90,14],[90,15,90,18],[90,19,90,22],[90,23,90,25],[89,0,89,4],[89,5,89,10],[89,11,89,14],[89,15,89,18],[89,19,89,22],[81,26,90,26],[82,11,82,14],[83,11,83,14],[83,19,83,22],[84,11,84,14],[84,19,84,22],[87,23,88,25],[88,11,88,14],[87,19,88,22],[94,26,99,26],[94,5,97,10],[94,15,97,18],[94,19,97,22],[99,0,99,4],[99,5,99,10],[99,11,99,14],[99,15,99,18],[105,0,105,4],[105,5,105,10],[105,11,105,14],[105,15,105,18],[105,19,105,22],[99,19,99,22],[98,0,98,4],[98,5,98,10],[98,11,98,14],[98,15,98,18],[98,19,98,22],[95,11,95,14],[96,11,96,14],[94,23,94,24],[98,23,98,25],[94,0,97,4],[105,23,105,25],[100,26,106,26],[101,11,101,14],[102,11,102,14],[103,0,104,4],[103,5,104,10],[103,11,103,14],[103,15,104,18],[103,19,104,22],[104,11,104,14],[100,0,102,4],[100,5,102,10],[100,11,100,14],[100,15,102,18],[100,19,102,22],[100,23,102,25],[106,11,106,14],[106,15,106,18],[106,19,106,22],[106,23,106,25],[113,19,113,22],[116,0,116,25],[117,0,119,4],[117,5,119,10],[117,11,119,14],[117,15,119,18],[117,19,119,22],[123,0,124,22],[106,0,106,4],[106,5,106,10],[129,13,129,24],[146,10,146,16],[146,17,146,24],[147,10,148,16],[167,10,167,24],[107,0,110,4],[107,5,110,10],[107,11,110,14],[107,15,110,18],[107,19,107,22],[107,23,110,25],[108,19,108,22],[109,19,109,22],[110,19,110,22],[114,19,114,22],[115,19,115,22],[123,23,126,25],[125,0,126,22],[111,0,111,25],[112,0,115,4],[112,5,115,10],[112,11,115,14],[112,15,115,18],[112,19,112,22],[280,10,280,24],[278,10,278,24],[260,10,260,24],[257,10,258,24],[259,10,259,24],[128,1,128,9],[128,10,128,24],[140,10,140,24],[156,10,157,24],[130,1,131,9],[138,10,139,24],[171,10,171,24],[168,1,170,9],[168,10,168,24],[169,10,169,24],[132,1,134,9],[132,10,132,24],[134,10,134,24],[165,10,165,24],[158,1,158,9],[160,10,160,24],[135,10,135,24],[167,1,167,9],[129,1,129,12],[190,10,191,24],[192,1,193,9],[188,1,188,9],[149,10,150,16],[149,17,150,24],[282,1,283,9],[282,10,283,24],[261,10,265,24],[266,10,267,24],[268,10,269,24],[279,10,279,24],[275,10,275,24],[280,1,280,9],[281,1,281,9],[281,10,281,24],[276,10,276,24],[277,10,277,24],[271,10,271,24],[273,10,273,24],[272,10,272,24],[257,1,269,9],[270,10,270,24],[270,1,274,9],[274,10,274,24],[144,10,144,16],[145,10,145,16],[144,17,144,24],[147,17,148,24],[172,10,172,24],[173,10,173,24],[185,0,186,22],[180,1,181,9],[180,10,181,24],[166,1,166,9],[178,10,178,24],[164,1,165,9],[164,10,164,24],[155,1,157,9],[155,10,155,24],[175,10,175,24],[256,1,256,9],[254,1,255,9],[254,10,255,24],[215,10,215,24],[216,1,217,9],[113,23,113,25],[103,23,103,25],[256,10,256,24],[243,0,244,22],[211,1,212,9],[211,10,211,24],[212,10,212,24],[216,10,217,24],[203,1,205,9],[195,10,195,24],[195,1,195,9],[197,10,197,24],[198,10,199,24],[196,1,202,9],[194,1,194,9],[249,1,249,24],[250,10,251,24],[243,23,246,25],[245,0,246,22],[196,10,196,24],[252,1,253,9],[203,10,203,24],[204,10,204,24],[252,10,252,24],[253,10,253,13],[253,14,253,24],[194,10,194,24],[183,0,184,22],[214,10,214,24],[213,1,213,9],[205,10,205,24],[200,10,200,24],[206,1,210,9],[206,10,206,24],[207,10,207,24],[208,10,208,24],[209,10,209,24],[210,10,210,24],[214,1,214,9],[202,10,202,24],[201,10,201,24],[215,1,215,9],[192,10,192,24],[21,17,23,24],[21,10,21,16],[22,10,22,16],[23,10,23,16],[117,23,117,25],[121,0,121,25],[99,23,99,24],[279,1,279,9],[275,1,278,9],[213,10,213,24],[190,1,191,9],[159,1,159,24],[160,1,163,9],[130,10,131,24],[136,1,136,9],[183,23,186,25],[193,10,193,24],[179,1,179,9],[179,10,179,24],[188,10,188,24],[248,1,248,9],[250,1,251,9],[248,10,248,24],[189,1,189,24]]}
[{"$f":"NCOM&\" (\"&PCOM&\")\"","v":"Comune di Trescore Cremasco (CR)"},null,null,null,null,null,null,{"$f":"IF(INDEX(INT,1,13)=\"\",INDEX(INT,1,1),INDEX(INT,1,13))","v":"Piano di Emergenza Intercomunale di Protezione Civile"},null,null,null,null,null,null,null,null,null,null,null,{"$f":"IF(TIPOP=\"Edizione\",\"Ed. \",IF(TIPOP=\"Revisione\",\"Rev. \",\"Bozza \"))&TIPON&\" del \"&TIPOD","v":"Ed. 01 del 04/11/2012"}]
[]
[]
["Scheda Scenario",null,null,null,null,null,null,null,null,null,null,null,null,null,null,null,null,null,null,null,null,null,null,{"$f":"_RSS5","v":"RIL.3"}]
[]
[{"$f":"IF(INDEX(RSS5PAR,1,19)=\"\",INDEX(RSS5PAR,1,12),INDEX(RSS5PAR,1,19))&\" - Fase di Allerta Codice 3\"","v":" - Fase di Allerta Codice 3"}]
[]
[]
[null,"Paragrafi di Riferimento ",null,null,null,null,null,null,null,null,{"$f":"INDEX(RSS5PAR,1,1)&INDEX(RSS5PAR,1,12)","v":""}]
[null,"Codice Scheda",null,null,null,null,null,null,null,null,{"$f":"X4","v":"RIL.3"}]
[null,"Evento atteso",null,null,null,null,null,null,null,null,"Esondazione di acque dal corso del Fiume Lambro dovute a portate non contenibili nell'alveo a seguito di precipitazioni di eccezionale entità o dovute a cedimento di argini o a ostruzioni delle luci dei ponti."]
[]
[]
[]
[null,"Attività U.C.L.",null,null,null,null,null,null,null,null,"Se i livelli fluviali nei punti di osservazione sono tali da far temere una evoluzione del fenomeno verso una possibile esondazione si attiva il Servizio di Salvaguardia. Rimangono operative, se attivo, le funzioni del Servizio di Allerta, viceversa deve essere attivato (Scheda RIL.2)."]
[]
[]
[]
[]
[null,"Ubicazione intervento",null,null,null,null,null,null,null,null,"Tutte le aree lungo l'aste del Fiume Lambro, con particolare attenzione per le zone antropizzate."]
[]
[null,"Personale mobilitato",null,null,null,null,null,null,null,null,{"$f":"IF(INDEX(RSS5PER,1,1)=\"\",\"\",\"- \"&VLOOKUP(INDEX(RSS5PER,1,1),Personale,IF(INDEX(Personale,INDEX(RSS5PER,1,1),14)=\"\",2,14)))","v":"- Polizia Locale"},null,null,null,null,null,null,"Riportare la composizione delle squadre nel Modulo M1"]
[null,null,null,null,null,null,null,null,null,null,{"$f":"IF(INDEX(RSS5PER,1,2)=\"\",\"\",\"- \"&VLOOKUP(INDEX(RSS5PER,1,2),Personale,IF(INDEX(Personale,INDEX(RSS5PER,1,2),14)=\"\",2,14)))","v":"- Volontari P.C."}]
[null,null,null,null,null,null,null,null,null,null,{"$f":"IF(INDEX(RSS5PER,1,3)=\"\",\"\",\"- \"&VLOOKUP(INDEX(RSS5PER,1,3),Personale,IF(INDEX(Personale,INDEX(RSS5PER,1,3),14)=\"\",2,14)))","v":"- Tecnici/Operai Comunali"}]
[null,"Attività personale mobilitato",null,null,null,null,null,null,null,null,"Attivazione delle aree di raccolta della popolazione e di ricovero ed evacuazione della popolazione interessata. Se non già attivo si rende operativo il Servizio di Allerta."]
[]
[]
[null,"Grado di coinvolgimento della popolazione",null,null,null,null,null,null,null,null," Si procede con l’informativa alla popolazione potenzialmente interessata dall'esondazione e, se necessario, si procede alla loro evacuazione."]
[]
[null,null,null,null,null,null,null,null,null,null,"Registrare le persone eventualmente evacuate nel Modulo M2"]
[null,"Cancelli e vie alternative",null,null,null,null,null,null,null,null,"Possono essere posizionati i seguenti cancelli finalizzati alla regolazione del traffico nei seguenti incroci. Il posizionamento può essere modificato e possono esserne aggiunti nuovi in funzione dell'evoluzione del fenomeno."]
[]
[]
[null,null,null,null,null,null,null,null,null,null,{"$f":"\"N° \"&[1]Maschera!BT75&\": \"&[1]Maschera!BU75","v":"N° : "}]
[null,null,null,null,null,null,null,null,null,null,{"$f":"\"N° \"&[1]Maschera!BT76&\": \"&[1]Maschera!BU76","v":"N° : "}]
[null,null,null,null,null,null,null,null,null,null,{"$f":"\"N° \"&[1]Maschera!BT77&\": \"&[1]Maschera!BU77","v":"N° : "}]
[null,null,null,null,null,null,null,null,null,null,{"$f":"\"N° \"&[1]Maschera!BT78&\": \"&[1]Maschera!BU78","v":"N° : "}]
[null,"Aree di raccolta popolazione",null,null,null,null,null,null,null,null,{"$f":"IF(INDEX(RSS5RIC,1,1)=\"\",\"In questa fase non è prevista l’attivazione di tali aree.\",\"Per questa emergenza \"&IF(INDEX(RSS5RIC,1,2)=\"\",\"è disponibile la seguente area:\",\"sono disponibili le seguenti aree:\"))","v":"In questa fase non è prevista l’attivazione di tali aree."}]
[null,null,null,null,null,null,null,null,null,null,{"$f":"IF(INDEX(RSS5RIC,1,1)=\"\",\"\",\"- \"&VLOOKUP(INDEX(RSS5RIC,1,1),Ricovero,2))","v":""}]
[null,null,null,null,null,null,null,null,null,null,{"$f":"IF(INDEX(RSS5RIC,1,2)=\"\",\"\",\"- \"&VLOOKUP(INDEX(RSS5RIC,1,2),Ricovero,2))","v":""}]
[null,null,null,null,null,null,null,null,null,null,{"$f":"IF(INDEX(RSS5RIC,1,3)=\"\",\"\",\"- \"&VLOOKUP(INDEX(RSS5RIC,1,3),Ricovero,2))","v":""}]
[null,"Area di ricovero",null,null,null,null,null,null,null,null,{"$f":"IF(INDEX(RSS5RIC,1,4)=\"\",\"\",\"- \"&VLOOKUP(INDEX(RSS5RIC,1,4),Ricovero,2))","v":""}]
[null,null,null,null,null,null,null,null,null,null,{"$f":"IF(K41=\"\",\"\",\"In funzione della gravità della situazione si decide quali/quante aree attivare.\")","v":""}]
[null,"Area di raduno soccorritori",null,null,null,null,null,null,null,null,{"$f":"IF(INDEX(RSS5SOC,1,1)=\"\",\"In questa fase non è prevista l’attivazione di tali aree.\",\"Per questa emergenza \"&IF(INDEX(RSS5SOC,1,2)=\"\",\"è disponibile la seguente area:\",\"sono disponibili le seguenti aree:\"))","v":"In questa fase non è prevista l’attivazione di tali aree."}]
[null,null,null,null,null,null,null,null,null,null,{"$f":"IF(INDEX(RSS5SOC,1,1)=\"\",\"\",\"- \"&VLOOKUP(INDEX(RSS5SOC,1,1),Soccorritori,2))","v":""}]
[null,null,null,null,null,null,null,null,null,null,{"$f":"IF(INDEX(RSS5SOC,1,2)=\"\",\"\",\"- \"&VLOOKUP(INDEX(RSS5SOC,1,2),Soccorritori,2))","v":""}]
[null,null,null,null,null,null,null,null,null,null,{"$f":"IF(INDEX(RSS5SOC,1,3)=\"\",\"\",\"- \"&VLOOKUP(INDEX(RSS5SOC,1,3),Soccorritori,2))","v":""}]
[null,null,null,null,null,null,null,null,null,null,{"$f":"IF(K45=\"\",\"\",\"In funzione della gravità della situazione si decide quali/quante aree attivare.\")","v":""}]
[null,"Ordinanze Necessarie",null,null,null,null,null,null,null,null,"Ordinanza di Evacuazione;"]
[null,null,null,null,null,null,null,null,null,null,"Ordinanza di Chiusura Strade."]
[null,"Modalita’ Riunione U.C.L.",null,null,null,null,null,null,null,null,null,"Non necessaria"]
[null,null,null,null,null,null,null,null,null,null,null,"Virtuale"]
[null,null,null,null,null,null,null,null,null,null,"X","In sede"]
[null,"Possibili Scenari Concomitanti",null,null,null,null,null,null,null,null,"Non ragionevolmente prevedibile la concomitanza con altri eventi."]
[]
[]
[]
[null,"Contatti Utili",null,null,null,null,null,null,null,null,{"$f":"\"Consultare il \"&IF([1]Maschera!Z71=\"\",[1]Maschera!N71,[1]Maschera!Z71)","v":"Consultare il Tomo Giallo - Risorse"}]
[null,"Cartografia",null,null,null,null,null,null,null,null,{"$f":"INDEX(RSS5PAR,1,28)","v":0}]
[null,null,null,null,null,null,null,null,null,null,{"$f":"INDEX(RSS5PAR,1,39)","v":0}]
[null,null,null,null,null,null,null,null,null,null,{"$f":"INDEX(RSS5PAR,1,50)","v":0}]
[]
[]
[{"$f":"Titolo2","v":"Procedure U.C.L."},null,null,null,null,null,null,null,null,null,null,null,null,null,null,null,null,null,null,null,null,null,null,{"$f":"X4","v":"RIL.3"}]
[]
[{"$f":"$A$6","v":" - Fase di Allerta Codice 3"}]
[]
[]
["RESPONSABILE",null,null,null,null,"AZIONE",null,null,null,null,null,"CHIAMATE"]
[null,null,null,null,null,null,null,null,null,null,null,"MEMBRO UCL",null,null,null,"OPERATIVI",null,null,null,"ENTE INTERESSATO",null,null,null,"SCHEDE CHIAMATE"]
[]
[{"$f":"IF(INDEX(Sindaco,1,9)=\"\",INDEX(Sindaco,1,1),INDEX(Sindaco,1,9))","v":"SINDACO / R.O.C."},null,null,null,null,"Avvisa della Fase di Allerta Codice 3 gli enti sovraordinati e attiva l’UCL.",null,null,null,null,null,"- Tutti",null,null,null,"--",null,null,null,{"$f":"\"- \"&IF(INDEX(PR,1,9)=\"\",INDEX(PR,1,1),INDEX(PR,1,9))","v":"- Prefettura"},null,null,null,"O1 - O2"]
[null,null,null,null,null,null,null,null,null,null,null,null,null,null,null,null,null,null,null,{"$f":"\"- \"&IF(INDEX(PRO,1,9)=\"\",INDEX(PRO,1,1),INDEX(PRO,1,9))","v":"- Provincia"},null,null,null,"C2.1","C2.3","C2.4"]
[null,null,null,null,null,null,null,null,null,null,null,null,null,null,null,null,null,null,null,{"$f":"\"- \"&IF(INDEX(REG,1,9)=\"\",INDEX(REG,1,1),INDEX(REG,1,9))","v":"- Regione"}]
[{"$f":"IF(INDEX(ROC,1,9)=\"\",INDEX(ROC,1,1),INDEX(ROC,1,9))","v":"R.O.C."},null,null,null,null,{"$f":"\"Attiva e rinforza il Servizio di Allerta. \"&_RSS4&\".1\"","v":"Attiva e rinforza il Servizio di Allerta. RIL.2.1"},null,null,null,null,null,"--",null,null,null,"--",null,null,null,"--",null,null,null,"O1 - O2"]
["(Codice 3 non preceduto da Codice 2)"]
[]
[{"$f":"IF(INDEX(Sindaco,1,9)=\"\",INDEX(Sindaco,1,1),INDEX(Sindaco,1,9))","v":"SINDACO / R.O.C."},null,null,null,null,"Informa su quanto fatto gli enti sovraordinati.",null,null,null,null,null,"--",null,null,null,"--",null,null,null,{"$f":"\"- \"&IF(INDEX(PR,1,9)=\"\",INDEX(PR,1,1),INDEX(PR,1,9))","v":"- Prefettura"},null,null,null,"C2.1  C2.4"]
[null,null,null,null,null,null,null,null,null,null,null,null,null,null,null,null,null,null,null,{"$f":"\"- \"&IF(INDEX(PRO,1,9)=\"\",INDEX(PRO,1,1),INDEX(PRO,1,9))","v":"- Provincia"}]
[null,null,null,null,null,null,null,null,null,null,null,null,null,null,null,null,null,null,null,{"$f":"\"- \"&IF(INDEX(REG,1,9)=\"\",INDEX(REG,1,1),INDEX(REG,1,9))","v":"- Regione"}]
[]
[{"$f":"IF(INDEX(Sindaco,1,9)=\"\",INDEX(Sindaco,1,1),INDEX(Sindaco,1,9))","v":"SINDACO / R.O.C."},null,null,null,null,{"$f":"\"Se necessario dispone cancelli su strade comunali, statali e/o provinciali e procede con l'informazione alla popolazione delle zone interessate. \"&_RSS5&\".1\"","v":"Se necessario dispone cancelli su strade comunali, statali e/o provinciali e procede con l'informazione alla popolazione delle zone interessate. RIL.3.1"},null,null,null,null,null,null,null,null,null,"--",null,null,null,null,null,null,null,"O1 - O2  C2.1",null,null,{"$f":"_RSS5&\".1\"","v":"RIL.3.1"}]
[null,null,null,null,null,null,null,null,null,null,null,{"$f":"\"- \"&PROPER(IF(INDEX(PL,1,9)=\"\",INDEX(PL,1,1),INDEX(PL,1,9)))","v":"- Polizia Locale"}]
[null,null,null,null,null,null,null,null,null,null,null,{"$f":"\"- \"&PROPER(IF(INDEX(CV,1,9)=\"\",INDEX(CV,1,1),INDEX(CV,1,9)))","v":"- C. Volontariato"},null,null,null,null,null,null,null,{"$f":"\"- \"&IF(INDEX(CL,1,9)=\"\",INDEX(CL,1,1),INDEX(CL,1,9))","v":"- Comuni Limitrofi"}]
[null,null,null,null,null,null,null,null,null,null,null,{"$f":"\"- \"&PROPER(IF(INDEX(CC,1,9)=\"\",INDEX(CC,1,1),INDEX(CC,1,9)))","v":"- C. Carabinieri"},null,null,null,null,null,null,null,{"$f":"\"- \"&IF(INDEX(PRO,1,9)=\"\",INDEX(PRO,1,1),INDEX(PRO,1,9))","v":"- Provincia"}]
[]
[]
[{"$f":"IF(INDEX(PL,1,9)=\"\",INDEX(PL,1,1),INDEX(PL,1,9))","v":"POLIZIA LOCALE"},null,null,null,null,{"$f":"\"Responsabile \"&_RSS5&\".1\"","v":"Responsabile RIL.3.1"},null,null,null,null,null,{"$f":"\"- \"&PROPER(IF(INDEX(CV,1,9)=\"\",INDEX(CV,1,1),INDEX(CV,1,9)))","v":"- C. Volontariato"},null,null,null,{"$f":"\"- \"&IF(INDEX(PLO,1,9)=\"\",INDEX(PLO,1,1),INDEX(PLO,1,9))","v":"- Agenti P.L."},null,null,null,"--",null,null,null,"O1 - O2  A2.2"]
[null,null,null,null,null,null,null,null,null,null,null,{"$f":"\"- \"&PROPER(IF(INDEX(CC,1,9)=\"\",INDEX(CC,1,1),INDEX(CC,1,9)))","v":"- C. Carabinieri"}]
[{"$f":"IF(INDEX(CV,1,9)=\"\",INDEX(CV,1,1),INDEX(CV,1,9))","v":"C. VOLONTARIATO"},null,null,null,null,{"$f":"\"Coadiuva \"&_RSS5&\".1\"","v":"Coadiuva RIL.3.1"},null,null,null,null,null,"--",null,null,null,{"$f":"\"- \"&IF(INDEX(VO,1,9)=\"\",INDEX(VO,1,1),INDEX(VO,1,9))","v":"- Gruppi Volontari"},null,null,null,"--",null,null,null,"A3 - B3"]
[{"$f":"IF(INDEX(CC,1,9)=\"\",INDEX(CC,1,1),INDEX(CC,1,9))","v":"C. CARABINIERI"},null,null,null,null,{"$f":"\"Coadiuva \"&_RSS5&\".1\"","v":"Coadiuva RIL.3.1"},null,null,null,null,null,"--",null,null,null,{"$f":"\"- \"&IF(INDEX(CO,1,9)=\"\",INDEX(CO,1,1),INDEX(CO,1,9))","v":"- Carabinieri"},null,null,null,"--",null,null,null,"--"]
[{"$f":"IF(INDEX(Sindaco,1,9)=\"\",INDEX(Sindaco,1,1),INDEX(Sindaco,1,9))","v":"SINDACO / R.O.C."},null,null,null,null,{"$f":"\"Se necessario attiva le aree di emergenza \"&_RSS5&\".2\"","v":"Se necessario attiva le aree di emergenza RIL.3.2"},null,null,null,null,null,{"$f":"\"- \"&PROPER(IF(INDEX(RT,1,9)=\"\",INDEX(RT,1,1),INDEX(RT,1,9)))","v":"- Resp. Territorio"},null,null,null,"--",null,null,null,"--",null,null,null,"O1 - O2"]
[null,null,null,null,null,null,null,null,null,null,null,{"$f":"\"- \"&PROPER(IF(INDEX(CV,1,9)=\"\",INDEX(CV,1,1),INDEX(CV,1,9)))","v":"- C. Volontariato"}]
[null,null,null,null,null,null,null,null,null,null,null,{"$f":"\"- \"&PROPER(IF(INDEX(RSS,1,9)=\"\",INDEX(RSS,1,1),INDEX(RSS,1,9)))","v":"- Resp. Serv. Sociali"}]
[{"$f":"IF(INDEX(RT,1,9)=\"\",INDEX(RT,1,1),INDEX(RT,1,9))","v":"RESP. TERRITORIO"},null,null,null,null,{"$f":"\"Responsabile \"&_RSS5&\".2\"","v":"Responsabile RIL.3.2"},null,null,null,null,null,null,null,null,null,{"$f":"\"- \"&IF(INDEX(TCO,1,9)=\"\",INDEX(TCO,1,1),INDEX(TCO,1,9))","v":"- Tecnici Comunali"},null,null,null,"--",null,null,null,"O1 - O2",null,"A2.1",{"$f":"_RSS5&\".2\"","v":"RIL.3.2"}]
[null,null,null,null,null,null,null,null,null,null,null,{"$f":"\"- \"&PROPER(IF(INDEX(CV,1,9)=\"\",INDEX(CV,1,1),INDEX(CV,1,9)))","v":"- C. Volontariato"},null,null,null,null,null,null,null,null,null,null,null,"A4","A5","A6"]
[null,null,null,null,null,null,null,null,null,null,null,{"$f":"\"- \"&PROPER(IF(INDEX(RSS,1,9)=\"\",INDEX(RSS,1,1),INDEX(RSS,1,9)))","v":"- Resp. Serv. Sociali"},null,null,null,null,null,null,null,null,null,null,null,"A7.1","A7.2","B5"]
[null,null,null,null,null,null,null,null,null,null,null,null,null,null,null,null,null,null,null,null,null,null,null,"B6","C1"]
[{"$f":"IF(INDEX(CV,1,9)=\"\",INDEX(CV,1,1),INDEX(CV,1,9))","v":"C. VOLONTARIATO"},null,null,null,null,{"$f":"\"Coadiuva \"&_RSS5&\".2\"","v":"Coadiuva RIL.3.2"},null,null,null,null,null,"--",null,null,null,{"$f":"\"- \"&IF(INDEX(VO,1,9)=\"\",INDEX(VO,1,1),INDEX(VO,1,9))","v":"- Gruppi Volontari"},null,null,null,"--",null,null,null,"A3 - B3"]
[{"$f":"IF(INDEX(RSS,1,9)=\"\",INDEX(RSS,1,1),INDEX(RSS,1,9))","v":"RESP. SERV. SOCIALI"},null,null,null,null,{"$f":"\"Coadiuva \"&_RSS5&\".2\"","v":"Coadiuva RIL.3.2"},null,null,null,null,null,"--",null,null,null,{"$f":"\"- \"&IF(INDEX(SO,1,9)=\"\",INDEX(SO,1,1),INDEX(SO,1,9))","v":"- Pers. Sanitario"},null,null,null,"--",null,null,null,"B1 - C2.2 ",null,"D1"]
[{"$f":"IF(INDEX(Sindaco,1,9)=\"\",INDEX(Sindaco,1,1),INDEX(Sindaco,1,9))","v":"SINDACO / R.O.C."},null,null,null,null,{"$f":"\"Se necessario ordina evacuazioni. \"&_RSS5&\".3\"","v":"Se necessario ordina evacuazioni. RIL.3.3"},null,null,null,null,null,{"$f":"\"- \"&PROPER(IF(INDEX(PL,1,9)=\"\",INDEX(PL,1,1),INDEX(PL,1,9)))","v":"- Polizia Locale"},null,null,null,"--",null,null,null,"--",null,null,null,"O1 - O2",null,null,{"$f":"_RSS5&\".3\"","v":"RIL.3.3"}]
[null,null,null,null,null,null,null,null,null,null,null,{"$f":"\"- \"&PROPER(IF(INDEX(CV,1,9)=\"\",INDEX(CV,1,1),INDEX(CV,1,9)))","v":"- C. Volontariato"}]
[null,null,null,null,null,null,null,null,null,null,null,{"$f":"\"- \"&PROPER(IF(INDEX(CC,1,9)=\"\",INDEX(CC,1,1),INDEX(CC,1,9)))","v":"- C. Carabinieri"}]
[{"$f":"IF(INDEX(PL,1,9)=\"\",INDEX(PL,1,1),INDEX(PL,1,9))","v":"POLIZIA LOCALE"},null,null,null,null,{"$f":"\"Responsabile \"&_RSS5&\".3\"","v":"Responsabile RIL.3.3"},null,null,null,null,null,{"$f":"\"- \"&PROPER(IF(INDEX(CV,1,9)=\"\",INDEX(CV,1,1),INDEX(CV,1,9)))","v":"- C. Volontariato"},null,null,null,{"$f":"\"- \"&IF(INDEX(PLO,1,9)=\"\",INDEX(PLO,1,1),INDEX(PLO,1,9))","v":"- Agenti P.L."},null,null,null,"--",null,null,null,"O1 - O2  A2.2"]
[null,null,null,null,null,null,null,null,null,null,null,{"$f":"\"- \"&PROPER(IF(INDEX(CC,1,9)=\"\",INDEX(CC,1,1),INDEX(CC,1,9)))","v":"- C. Carabinieri"},null,null,null,null,null,null,null,null,null,null,null,"M2","D2"]
[{"$f":"IF(INDEX(CV,1,9)=\"\",INDEX(CV,1,1),INDEX(CV,1,9))","v":"C. VOLONTARIATO"},null,null,null,null,{"$f":"\"Coadiuva \"&_RSS5&\".3\"","v":"Coadiuva RIL.3.3"},null,null,null,null,null,"--",null,null,null,{"$f":"\"- \"&IF(INDEX(VO,1,9)=\"\",INDEX(VO,1,1),INDEX(VO,1,9))","v":"- Gruppi Volontari"},null,null,null,"--",null,null,null,"A3 - B3"]
[{"$f":"IF(INDEX(CC,1,9)=\"\",INDEX(CC,1,1),INDEX(CC,1,9))","v":"C. CARABINIERI"},null,null,null,null,{"$f":"\"Coadiuva \"&_RSS5&\".3\"","v":"Coadiuva RIL.3.3"},null,null,null,null,null,"--",null,null,null,{"$f":"\"- \"&IF(INDEX(CO,1,9)=\"\",INDEX(CO,1,1),INDEX(CO,1,9))","v":"- Carabinieri"},null,null,null,"--",null,null,null,"--"]
[{"$f":"IF(INDEX(Sindaco,1,9)=\"\",INDEX(Sindaco,1,1),INDEX(Sindaco,1,9))","v":"SINDACO / R.O.C."},null,null,null,null,"Informa periodicamente gli enti sovraordinati e i media su quanto fatto.",null,null,null,null,null,"--",null,null,null,"--",null,null,null,{"$f":"\"- \"&IF(INDEX(PR,1,9)=\"\",INDEX(PR,1,1),INDEX(PR,1,9))","v":"- Prefettura"},null,null,null,"C2.1  C2.3  C2.4"]
[null,null,null,null,null,null,null,null,null,null,null,null,null,null,null,null,null,null,null,{"$f":"\"- \"&IF(INDEX(PRO,1,9)=\"\",INDEX(PRO,1,1),INDEX(PRO,1,9))","v":"- Provincia"}]
[null,null,null,null,null,null,null,null,null,null,null,null,null,null,null,null,null,null,null,{"$f":"\"- \"&IF(INDEX(REG,1,9)=\"\",INDEX(REG,1,1),INDEX(REG,1,9))","v":"- Regione"}]
[]
["SE L’EVENTO EVOLVE VERSO UNA SITUAZIONE DI PERICOLO IMMINENTE"]
[{"$f":"IF(INDEX(Sindaco,1,9)=\"\",INDEX(Sindaco,1,1),INDEX(Sindaco,1,9))","v":"SINDACO / R.O.C."},null,null,null,null,"Dichira lo stato di Allerta Codice 4.",null,null,null,null,null,"- Tutti",null,null,null,"--",null,null,null,{"$f":"\"- \"&IF(INDEX(PR,1,9)=\"\",INDEX(PR,1,1),INDEX(PR,1,9))","v":"- Prefettura"}]
[null,null,null,null,null,null,null,null,null,null,null,null,null,null,null,null,null,null,null,{"$f":"\"- \"&IF(INDEX(PRO,1,9)=\"\",INDEX(PRO,1,1),INDEX(PRO,1,9))","v":"- Provincia"},null,null,null,"O1 - O2"]
[null,null,null,null,null,null,null,null,null,null,null,null,null,null,null,null,null,null,null,{"$f":"\"- \"&IF(INDEX(REG,1,9)=\"\",INDEX(REG,1,1),INDEX(REG,1,9))","v":"- Regione"},null,null,null,"C2.1","C2.3","C2.4"]
[]
["SE VIENE COMUNICATO LA CESSATA ALLERTA CODICE 3"]
[{"$f":"IF(INDEX(Sindaco,1,9)=\"\",INDEX(Sindaco,1,1),INDEX(Sindaco,1,9))","v":"SINDACO / R.O.C."},null,null,null,null,"Informa i media della Cessata Allerta Codice 3 e dispone il rientro della popolazione.",null,null,null,null,null,"- Tutti",null,null,null,"--",null,null,null,"--",null,null,null,"O1 - O2  C2.3"]
[null,null,null,null,null,null,null,null,null,null,null,null,null,null,null,null,null,null,null,null,null,null,null,"M1","M2"]
[]
[]
["PER LE COMUNICAZIONI EVIDENZIATE IN ROSSO UTILIZZARE IL MODULO FAX M4"]
[]
[{"$f":"Titolo3","v":"Scheda Procedura Operativa"},null,null,null,null,null,null,null,null,null,null,null,null,null,null,null,null,null,null,null,null,null,null,{"$f":"X4&\".1\"","v":"RIL.3.1"}]
[]
[{"$f":"$A$6","v":" - Fase di Allerta Codice 3"}]
[]
[]
[null,"Codice Scheda Scenario",null,null,null,null,null,null,null,null,{"$f":"X4","v":"RIL.3"}]
[null,"SERVIZIO DI SALVAGUARDIA ",null,null,null,null,null,null,null,null,null,null,null,"- POSIZIONAMENTO CANCELLI"]
[null,"Descrizione attività",null,null,null,null,null,null,null,null,"Predisposizione di cancelli per il traffico con finalità di blocco totale del traffico in ingresso alla zona soggetta ad esondazione."]
[]
[null,"Personale Coinvolto",null,null,null,null,null,null,null,null,"Polizia Locale"]
[null,null,null,null,null,null,null,null,null,null,"Volontari P.C."]
[null,null,null,null,null,null,null,null,null,null,"Tecnici/Operai Comunali"]
[null,"Numero Operatori",null,null,null,null,null,null,null,null,"Ad ogni cancello un agente di Polizia Locale ed un Volontario di P.C."]
[null,"Automezzo dedicato",null,null,null,null,null,null,null,null,"Non necessario"]
[null,"Azioni",null,null,null,null,null,null,null,null,"Il presidio dei cancelli è effettuato con i seguenti criteri:"]
[null,null,null,null,null,null,null,null,null,null,"- Non deve essere consentito l'accesso a nessun mezzo privato. Solo i residenti prima di eventuali evacuazioni possono passare."]
[]
[null,null,null,null,null,null,null,null,null,null,"- L'accesso è quindi consentito sempre ai mezzi di soccorso."]
[null,null,null,null,null,null,null,null,null,null,"- Fare un periodico rapporto al UCL."]
[null,"Posizionamento Cancelli",null,null,null,null,null,null,null,null,"I cancelli attivabili sono posizionati ai seguenti incroci come da cartografia allegata:"]
[]
[null,null,null,null,null,null,null,null,null,null,"POSIZIONAMENTO",null,null,null,null,null,null,"DIREZIONE VIETATA"]
[null,null,null,null,null,null,null,null,null,null,{"$f":"\"N° \"&[1]Maschera!BT74&\": \"&[1]Maschera!BU74","v":"N° : "},null,null,null,null,null,null,{"$f":"[1]Maschera!BV74","v":0}]
[null,null,null,null,null,null,null,null,null,null,{"$f":"\"N° \"&[1]Maschera!BT75&\": \"&[1]Maschera!BU75","v":"N° : "},null,null,null,null,null,null,{"$f":"[1]Maschera!BV75","v":0}]
[null,null,null,null,null,null,null,null,null,null,{"$f":"\"N° \"&[1]Maschera!BT76&\": \"&[1]Maschera!BU76","v":"N° : "},null,null,null,null,null,null,{"$f":"[1]Maschera!BV76","v":0}]
[]
[null,null,null,null,null,null,null,null,null,null,{"$f":"\"N° \"&[1]Maschera!BT77&\": \"&[1]Maschera!BU77","v":"N° : "},null,null,null,null,null,null,{"$f":"[1]Maschera!BV77","v":0}]
[]
[null,null,null,null,null,null,null,null,null,null,{"$f":"\"N° \"&[1]Maschera!BT78&\": \"&[1]Maschera!BU78","v":"N° : "},null,null,null,null,null,null,{"$f":"[1]Maschera!BV78","v":0}]
[]
[null,null,null,null,null,null,null,null,null,null,"Il numero di cancelli da attivare e le eventuali variazioni di posizionamento sono da concordare con l'UCL."]
[]
[null,"Equipaggiamento minimo consigliato ",null,null,null,null,null,null,null,null,"Vestiario alta visibilità EN471 – Impermeabile"]
[null,null,null,null,null,null,null,null,null,null,"Torcia elettrica  - Paletta - Transenne e/o nastro segnaletico - Cartelli segnaletici"]
[]
[null,"Modalità di comunicazione",null,null,null,null,null,null,null,null,"Cellulare / Radio"]
[null,"SERVIZIO DI SALVAGUARDIA - INFORMAZIONE ALLA POPOLAZIONE"]
[null,"Descrizione attività",null,null,null,null,null,null,null,null,"Fornire alle persone esposte informazioni circa:"]
[null,null,null,null,null,null,null,null,null,null,"- la tipologia di evento calamitoso in atto;"]
[null,null,null,null,null,null,null,null,null,null,"- le misure di contrasto e/o prevenzione adottate;"]
[null,null,null,null,null,null,null,null,null,null,"- il comportamento da seguire."]
[null,"Personale Coinvolto",null,null,null,null,null,null,null,null,"Polizia Locale"]
[null,null,null,null,null,null,null,null,null,null,"Volontari P.C."]
[null,"Numero Operatori Consigliato",null,null,null,null,null,null,null,null,"Minimo 2 "]
[null,"Automezzo dedicato",null,null,null,null,null,null,null,null,"Si"]
[null,"Equipaggiamento minimo consigliato ",null,null,null,null,null,null,null,null,"Vestiario alta visibilità EN471 - Impermeabile"]
[null,null,null,null,null,null,null,null,null,null,"Torcia elettrica"]
[null,null,null,null,null,null,null,null,null,null,"Megafono o altoparlante"]
[null,"Modalità di comunicazione",null,null,null,null,null,null,null,null,"Cellulare / Radio"]
[null,"Ubicazione intervento",null,null,null,null,null,null,null,null,"Le aree abitate, con particolare attenzione per le seguenti località:"]
[null,null,null,null,null,null,null,null,null,null,"Località Cascina Grugnana - Via Madonna della Neve"]
[null,null,null,null,null,null,null,null,null,null,"Località Cascina Campello - Via Parco"]
[null,null,null,null,null,null,null,null,null,null,"Località Cascina Molino - Via Regina Margherita"]
[null,null,null,null,null,null,null,null,null,null,"Località San Giorgio - Via Regina Margherita"]
[null,"Procedure Operativa Standard (POS)",null,null,null,null,null,null,null,null,"Presidio Cancelli/Supporto Viabilità"]
[null,null,null,null,null,null,null,null,null,null,"Informazione Diretta alla Popolazione"]
[null,"Termine intervento",null,null,null,null,null,null,null,null,"Concordato con UCL - Alla fine della fase di emergenza."]
[null,"Contatti Utili",null,null,null,null,null,null,null,null,"Si faccia riferimento al PRONTUARIO DI EMERGENZA - CONTATTI"]
[]
[]
[{"$f":"Titolo3","v":"Scheda Procedura Operativa"},null,null,null,null,null,null,null,null,null,null,null,null,null,null,null,null,null,null,null,null,null,null,{"$f":"X64&\".2\"","v":"RIL.3.2"}]
[]
[{"$f":"$A$6","v":" - Fase di Allerta Codice 3"}]
[]
[]
[null,"Codice Scheda Scenario",null,null,null,null,null,null,null,null,{"$f":"X64","v":"RIL.3"}]
[null,"SERVIZIO DI SALVAGUARDIA - ATTIVAZIONE AREE DI EMERGENZA"]
[null,"Descrizione attività",null,null,null,null,null,null,null,null,"Consiste nel predisporre i materiali e le attrezzature necessarie all’accoglienza ed al ricovero della popolazione sfollata."]
[]
[null,"Personale Coinvolto",null,null,null,null,null,null,null,null,{"$f":"K23","v":"- Volontari P.C."}]
[null,null,null,null,null,null,null,null,null,null,{"$f":"K24","v":"- Tecnici/Operai Comunali"}]
[null,"Numero Operatori",null,null,null,null,null,null,null,null,"Una squadra"]
[null,"Automezzo dedicato",null,null,null,null,null,null,null,null,"Si"]
[null,"Azioni",null,null,null,null,null,null,null,null,"- Reperire, trasportare e posizionare i materiali presso le aree prescelte."]
[null,null,null,null,null,null,null,null,null,null,"- Organizzare un servizio di accoglienza registrazione e smistamento."]
[null,null,null,null,null,null,null,null,null,null,"- Verificare necessità di assistenza sanitaria ed eventualmente comunicarla all’UCL."]
[]
[null,null,null,null,null,null,null,null,null,null,"- Distribuire generi di prima necessità."]
[null,null,null,null,null,null,null,null,null,null,"- Fornire agli ospiti assistenza continua."]
[null,null,null,null,null,null,null,null,null,null,"- Fare periodico rapporto all’UCL."]
[null,"Ubicazione Aree di raccolta popolazione",null,null,null,null,null,null,null,null,{"$f":"K38","v":"In questa fase non è prevista l’attivazione di tali aree."}]
[null,null,null,null,null,null,null,null,null,null,{"$f":"K39","v":""}]
[null,null,null,null,null,null,null,null,null,null,{"$f":"K40","v":""}]
[null,"Aree di ricovero",null,null,null,null,null,null,null,null,{"$f":"K41","v":""}]
[null,null,null,null,null,null,null,null,null,null,{"$f":"K42","v":""}]
[null,null,null,null,null,null,null,null,null,null,{"$f":"IF(INDEX(RSS5RIC,1,5)=\"\",\"\",\"- \"&VLOOKUP(INDEX(RSS5RIC,1,5),Ricovero,2))","v":""}]
[null,null,null,null,null,null,null,null,null,null,{"$f":"IF(INDEX(RSS5RIC,1,6)=\"\",\"\",\"- \"&VLOOKUP(INDEX(RSS5RIC,1,6),Ricovero,2))","v":""}]
[null,null,null,null,null,null,null,null,null,null,{"$f":"K43","v":""}]
[null,"Equipaggiamento minimo consigliato ",null,null,null,null,null,null,null,null,"Brande/Cuscini/Materassi/Coperte"]
[null,null,null,null,null,null,null,null,null,null,"Generi di prima necessità (acqua, carta igienica, viveri, ecc.)"]
[null,"Modalità di comunicazione",null,null,null,null,null,null,null,null,"Cellulare / Radio"]
[null,"Procedure Operativa Standard (POS)",null,null,null,null,null,null,null,null,"Allestimento Area di Ricovero"]
[null,"Termine intervento",null,null,null,null,null,null,null,null,"Concordato con UCL - Alla fine della fase di emergenza."]
[null,"Contatti Utili",null,null,null,null,null,null,null,null,"Si faccia riferimento al PRONTUARIO DI EMERGENZA - CONTATTI"]
[]
[]
[]
[]
[]
[]
[]
[]
[]
[]
[]
[]
[]
[]
[]
[]
[]
[]
[]
[]
[]
[]
[]
[]
[]
[]
[{"$f":"Titolo3","v":"Scheda Procedura Operativa"},null,null,null,null,null,null,null,null,null,null,null,null,null,null,null,null,null,null,null,null,null,null,{"$f":"$X$4&\".3\"","v":"RIL.3.3"}]
[]
[{"$f":"$A$6","v":" - Fase di Allerta Codice 3"}]
[]
[]
[null,"Codice Scheda Scenario",null,null,null,null,null,null,null,null,{"$f":"X4","v":"RIL.3"}]
[null,"SERVIZIO DI SALVAGUARDIA - EVACUAZIONE"]
[null,"Descrizione attività",null,null,null,null,null,null,null,null,"Consiste nella notifica dell’ordinanza di evacuazione e verifica dell’esecuzione."]
[]
[null,"Personale coinvolto",null,null,null,null,null,null,null,null,"- Polizia Locale"]
[null,null,null,null,null,null,null,null,null,null,"- Volontari P.C.",null,null,null,"(Eventualmente Forze dell’Ordine)"]
[null,"Numero Operatori",null,null,null,null,null,null,null,null,"Almeno 2 per ogni area (obbligatoria la presenza di almeno 1 agente di Pubblica Sicurezza)."]
[]
[null,"Automezzo dedicato",null,null,null,null,null,null,null,null,"Si (Se necessario)"]
[null,"Azioni",null,null,null,null,null,null,null,null,"- Comunicazione ad ogni unità abitativa dell’allarme in atto e della necessità di evacuazione. "]
[]
[null,null,null,null,null,null,null,null,null,null,"- Disposizioni per un corretto allontanamento."]
[null,null,null,null,null,null,null,null,null,null,"- Informazione circa l’ubicazione dell’Area di Accoglienza/Ricovero."]
[null,null,null,null,null,null,null,null,null,null,"- Comunicare all’UCL se le persone evacuate intendano usufruire dell’Area di Accoglienza/Ricovero o se provvedono da soli al proprio alloggiamento presso strutture private (alberghi, parenti, amici…); in tal caso comunicare anche un recapito telefonico per comunicazioni di urgenza."]
[]
[]
[]
[]
[null,null,null,null,null,null,null,null,null,null,"- Comunicare all’UCL il progressivo sgombero dei numeri civici interessati."]
[]
[null,null,null,null,null,null,null,null,null,null,"- Se possibile a evacuazione ultimata presidio e controllo delle aree disabitate."]
[]
[null,"Ubicazione intervento",null,null,null,null,null,null,null,null,"Le aree abitate, con particolare attenzione per le seguenti località:"]
[null,null,null,null,null,null,null,null,null,null,"Località Cascina Grugnana - Via Madonna della Neve"]
[null,null,null,null,null,null,null,null,null,null,"Località Cascina Campello - Via Parco"]
[null,null,null,null,null,null,null,null,null,null,"Località Cascina Molino - Via Regina Margherita"]
[null,null,null,null,null,null,null,null,null,null,"Località San Giorgio - Via Regina Margherita"]
[null,"Equipaggiamento minimo consigliato ",null,null,null,null,null,null,null,null,"Vestiario alta visibilità EN471 – Impermeabile"]
[null,null,null,null,null,null,null,null,null,null,"Torcia elettrica"]
[null,null,null,null,null,null,null,null,null,null,"Copia della Ordinanza di Evacuazione"]
[null,null,null,null,null,null,null,null,null,null,"Copie Scheda M2 Tomo Giallo - Risorse"]
[null,"Modalità di comunicazione",null,null,null,null,null,null,null,null,"Cellulare / Radio"]
[null,"Procedure Operativa Standard (POS)",null,null,null,null,null,null,null,null,"Evacuazione Popolazione"]
[null,"Termine intervento",null,null,null,null,null,null,null,null,"Concordato con UCL - Alla fine della fase di emergenza."]
[null,"Contatti Utili",null,null,null,null,null,null,null,null,"Si faccia riferimento al PRONTUARIO DI EMERGENZA - CONTATTI"]

{"sheet":"RIL_4","index":18,"n_rows":209,"n_cols":27,"rows_kept":209,"cut":false,"hidden":false,"merged":[[60,10,60,24],[61,10,61,24],[59,1,61,9],[26,1,28,9],[53,1,57,9],[53,10,57,24],[58,1,58,9],[58,10,58,24],[29,1,31,9],[32,1,35,9],[32,10,35,24],[29,10,31,24],[36,1,38,9],[36,10,36,24],[38,10,38,24],[39,1,42,9],[39,10,39,24],[40,10,40,24],[42,10,42,24],[41,10,41,24],[37,10,37,24],[46,10,46,24],[0,0,1,6],[0,7,1,18],[0,19,1,25],[3,0,4,22],[3,23,6,25],[5,0,6,22],[52,11,52,24],[59,10,59,24],[10,10,13,24],[26,10,28,24],[8,10,8,24],[9,1,9,9],[9,10,9,24],[10,1,13,9],[8,1,8,9],[23,1,25,9],[14,1,20,9],[14,10,20,24],[21,1,22,9],[21,10,22,24],[23,17,25,24],[23,10,23,16],[24,10,24,16],[25,10,25,16],[72,0,74,4],[72,19,72,22],[73,19,73,22],[74,19,74,22],[63,0,64,22],[63,23,66,25],[65,0,66,22],[68,0,70,4],[68,5,70,10],[68,11,68,25],[69,11,70,14],[69,15,70,18],[69,19,70,22],[69,23,70,25],[72,23,72,25],[75,26,83,26],[76,11,76,14],[43,1,47,9],[43,10,43,24],[44,10,44,24],[50,1,52,9],[50,11,50,24],[51,11,51,24],[47,10,47,24],[48,1,49,9],[48,10,48,24],[49,10,49,24],[45,10,45,24],[71,0,71,4],[71,5,74,10],[71,11,74,14],[71,15,74,18],[71,19,71,22],[75,0,78,4],[75,5,78,10],[75,15,78,18],[75,19,78,22],[75,23,78,25],[83,5,83,10],[83,23,83,25],[79,23,79,24],[80,23,81,25],[89,19,89,22],[84,0,86,25],[87,0,90,4],[87,5,90,10],[87,11,87,14],[87,15,90,18],[87,19,87,22],[88,11,88,14],[88,19,88,22],[89,11,89,14],[88,23,88,25],[83,11,83,14],[83,15,83,18],[83,19,83,22],[79,0,82,4],[79,5,82,10],[79,15,82,18],[79,19,82,22],[80,11,80,14],[81,11,81,14],[83,0,83,4],[91,23,94,25],[94,5,94,10],[95,0,97,4],[95,5,97,10],[95,15,97,18],[95,19,97,22],[95,23,97,25],[101,19,101,22],[102,19,102,22],[91,0,94,4],[91,5,93,10],[91,11,94,14],[91,15,94,18],[91,19,94,22],[103,0,104,4],[103,5,106,10],[103,11,106,14],[103,15,106,18],[103,19,103,22],[104,19,104,22],[105,0,106,4],[105,19,105,22],[106,19,106,22],[95,26,97,26],[97,11,97,14],[98,0,98,25],[99,0,102,4],[99,5,102,10],[99,11,102,14],[99,15,102,18],[99,19,99,22],[100,19,100,22],[100,23,100,25],[107,0,107,25],[108,0,111,4],[108,5,111,10],[108,11,111,14],[108,15,111,18],[108,19,108,22],[109,19,109,22],[110,19,110,22],[111,19,111,22],[112,26,119,26],[113,11,113,14],[114,11,114,14],[116,0,118,4],[116,5,118,10],[116,15,118,18],[116,19,118,22],[117,11,117,14],[119,0,119,4],[119,5,119,10],[119,11,119,14],[119,15,119,18],[119,19,119,22],[119,23,119,25],[112,0,115,4],[112,5,115,10],[112,15,115,18],[112,19,115,22],[113,23,113,24],[116,23,116,24],[117,23,118,25],[123,0,124,22],[123,23,126,25],[125,0,126,22],[128,1,128,9],[128,10,128,24],[130,1,130,9],[130,10,130,24],[129,1,129,12],[129,13,129,24],[131,1,133,9],[136,1,145,9],[138,10,139,24],[140,10,141,24],[142,10,143,24],[135,1,135,9],[136,10,136,24],[137,10,137,24],[134,1,134,9],[208,1,209,9],[208,10,209,24],[193,10,193,24],[194,1,194,9],[194,10,194,24],[203,1,203,9],[203,10,203,24],[204,1,204,9],[206,1,206,9],[206,10,206,24],[202,10,202,24],[204,10,204,24],[205,1,205,9],[205,10,205,24],[201,10,201,24],[200,10,200,24],[207,1,207,9],[207,10,207,24],[121,0,121,25],[103,23,103,25],[197,10,197,24],[198,1,202,9],[198,10,198,24],[181,0,182,22],[181,23,184,25],[146,1,146,9],[146,10,146,24],[183,0,184,22],[131,10,131,24],[132,10,132,24],[133,10,133,24],[134,10,134,24],[135,10,135,24],[154,10,155,24],[153,10,153,24],[151,1,151,9],[144,10,145,24],[147,1,147,9],[199,10,199,24],[186,1,186,9],[186,10,186,24],[147,10,147,24],[148,10,150,24],[188,10,189,24],[154,1,155,9],[193,1,193,9],[195,1,197,9],[195,10,195,24],[196,10,196,24],[148,1,150,9],[153,1,153,9],[151,10,151,24],[152,1,152,9],[152,10,152,24],[187,1,187,24],[188,1,189,9],[190,1,192,9],[190,10,190,24],[191,10,191,24],[192,10,192,24]]}
[{"$f":"NCOM&\" (\"&PCOM&\")\"","v":"Comune di Trescore Cremasco (CR)"},null,null,null,null,null,null,{"$f":"IF(INDEX(INT,1,13)=\"\",INDEX(INT,1,1),INDEX(INT,1,13))","v":"Piano di Emergenza Intercomunale di Protezione Civile"},null,null,null,null,null,null,null,null,null,null,null,{"$f":"IF(TIPOP=\"Edizione\",\"Ed. \",IF(TIPOP=\"Revisione\",\"Rev. \",\"Bozza \"))&TIPON&\" del \"&TIPOD","v":"Ed. 01 del 04/11/2012"}]
[]
[]
["Scheda Scenario",null,null,null,null,null,null,null,null,null,null,null,null,null,null,null,null,null,null,null,null,null,null,{"$f":"_RSS6","v":"RIL.4"}]
[]
[{"$f":"IF(INDEX(RSS6PAR,1,19)=\"\",INDEX(RSS6PAR,1,12),INDEX(RSS6PAR,1,19))&\" - Fase di Allerta Codice 4\"","v":" - Fase di Allerta Codice 4"}]
[]
[]
[null,"Paragrafi di Riferimento ",null,null,null,null,null,null,null,null,{"$f":"INDEX(RSS6PAR,1,1)&INDEX(RSS6PAR,1,12)","v":""}]
[null,"Codice Scheda",null,null,null,null,null,null,null,null,{"$f":"X4","v":"RIL.4"}]
[null,"Evento atteso",null,null,null,null,null,null,null,null,"Esondazione di acque dal corso del Fiume Lambro dovute a portate non contenibili nell'alveo a seguito di precipitazioni di eccezionale entità o dovute a cedimento di argini o a ostruzioni delle luci dei ponti."]
[]
[]
[]
[null,"Attività U.C.L.",null,null,null,null,null,null,null,null,"Se i livelli fluviali nei punti di osservazione sono tali da far temere una imminente esondazione o se la tracimazione delle acque è in corso, si attiva il Servizio di Soccorso che ha la finalità di soccorrere ed allontanare la popolazione interessata dalle zone colpite. Se attivi rimangono operative le funzioni del Servizio di Salvaguardia ed Allerta, viceversa devono essere attivati (Schede RIL.2 - RIL.3)."]
[]
[]
[]
[]
[]
[]
[null,"Ubicazione intervento",null,null,null,null,null,null,null,null,"Tutte le aree lungo l'asta del Fiume Lambro, con particolare attenzione per le zone antropizzate."]
[]
[null,"Personale mobilitato",null,null,null,null,null,null,null,null,{"$f":"IF(INDEX(RSS6PER,1,1)=\"\",\"\",\"- \"&VLOOKUP(INDEX(RSS6PER,1,1),Personale,IF(INDEX(Personale,INDEX(RSS6PER,1,1),14)=\"\",2,14)))","v":"- Polizia Locale"},null,null,null,null,null,null,"Riportare la composizione delle squadre nel Modulo M1"]
[null,null,null,null,null,null,null,null,null,null,{"$f":"IF(INDEX(RSS6PER,1,2)=\"\",\"\",\"- \"&VLOOKUP(INDEX(RSS6PER,1,2),Personale,IF(INDEX(Personale,INDEX(RSS6PER,1,2),14)=\"\",2,14)))","v":"- Volontari P.C."}]
[null,null,null,null,null,null,null,null,null,null,{"$f":"IF(INDEX(RSS6PER,1,3)=\"\",\"\",\"- \"&VLOOKUP(INDEX(RSS6PER,1,3),Personale,IF(INDEX(Personale,INDEX(RSS6PER,1,3),14)=\"\",2,14)))","v":"- Tecnici/Operai Comunali"}]
[null,"Attività personale mobilitato",null,null,null,null,null,null,null,null,"Soccorso della popolazione colpita. Se non già attivo si rende operativo il Servizio di Allerta e quello di Salvaguardia. "]
[]
[]
[null,"Grado di coinvolgimento della popolazione",null,null,null,null,null,null,null,null,"Si procede con il soccorso alla popolazione colpita e si evacuano le persone che si trovano in zone pericolose. Si informa la popolazione sui comportamenti più sicuri da adottare in attesa dei soccorsi."]
[]
[]
[null,"Cancelli e vie alternative",null,null,null,null,null,null,null,null,"I cancelli già predisposti dal Servizio di Salvaguardia, se attivato, vengono integrati e/o spostati in funzione della gravità della esondazione in corso."]
[]
[]
[]
[null,"Aree di raccolta popolazione",null,null,null,null,null,null,null,null,{"$f":"IF(INDEX(RSS6RIC,1,1)=\"\",\"In questa fase non è prevista l’attivazione di tali aree.\",\"Per questa emergenza \"&IF(INDEX(RSS6RIC,1,2)=\"\",\"è disponibile la seguente area:\",\"sono disponibili le seguenti aree:\"))","v":"In questa fase non è prevista l’attivazione di tali aree."}]
[null,null,null,null,null,null,null,null,null,null,{"$f":"IF(INDEX(RSS6RIC,1,1)=\"\",\"\",\"- \"&VLOOKUP(INDEX(RSS6RIC,1,1),Ricovero,2))","v":""}]
[null,null,null,null,null,null,null,null,null,null,{"$f":"IF(INDEX(RSS6RIC,1,2)=\"\",\"\",\"- \"&VLOOKUP(INDEX(RSS6RIC,1,2),Ricovero,2))","v":""}]
[null,"Area di ricovero",null,null,null,null,null,null,null,null,{"$f":"IF(INDEX(RSS6RIC,1,3)=\"\",\"\",\"- \"&VLOOKUP(INDEX(RSS6RIC,1,3),Ricovero,2))","v":""}]
[null,null,null,null,null,null,null,null,null,null,{"$f":"IF(INDEX(RSS6RIC,1,4)=\"\",\"\",\"- \"&VLOOKUP(INDEX(RSS6RIC,1,4),Ricovero,2))","v":""}]
[null,null,null,null,null,null,null,null,null,null,{"$f":"IF(INDEX(RSS5RIC,1,6)=\"\",\"\",\"- \"&VLOOKUP(INDEX(RSS5RIC,1,6),Ricovero,2))","v":""}]
[null,null,null,null,null,null,null,null,null,null,{"$f":"IF(K39=\"\",\"\",\"In funzione della gravità della situazione si decide quali/quante aree attivare.\")","v":""}]
[null,"Area di raduno soccorritori",null,null,null,null,null,null,null,null,{"$f":"IF(INDEX(RSS6SOC,1,1)=\"\",\"In questa fase non è prevista l’attivazione di tali aree.\",\"Per questa emergenza \"&IF(INDEX(RSS6SOC,1,2)=\"\",\"è disponibile la seguente area:\",\"sono disponibili le seguenti aree:\"))","v":"In questa fase non è prevista l’attivazione di tali aree."}]
[null,null,null,null,null,null,null,null,null,null,{"$f":"IF(INDEX(RSS6SOC,1,1)=\"\",\"\",\"- \"&VLOOKUP(INDEX(RSS6SOC,1,1),Soccorritori,2))","v":""}]
[null,null,null,null,null,null,null,null,null,null,{"$f":"IF(INDEX(RSS6SOC,1,2)=\"\",\"\",\"- \"&VLOOKUP(INDEX(RSS6SOC,1,2),Soccorritori,2))","v":""}]
[null,null,null,null,null,null,null,null,null,null,{"$f":"IF(INDEX(RSS6SOC,1,3)=\"\",\"\",\"- \"&VLOOKUP(INDEX(RSS6SOC,1,3),Soccorritori,2))","v":""}]
[null,null,null,null,null,null,null,null,null,null,{"$f":"IF(K46=\"\",\"\",\"In funzione della gravità della situazione si decide quali/quante aree attivare.\")","v":""}]
[null,"Ordinanze Necessarie",null,null,null,null,null,null,null,null,"Ordinanza di Evacuazione;"]
[null,null,null,null,null,null,null,null,null,null,"Ordinanza di Chiusura Strade."]
[null,"Modalita’ Riunione U.C.L.",null,null,null,null,null,null,null,null,null,"Non necessaria"]
[null,null,null,null,null,null,null,null,null,null,null,"Virtuale"]
[null,null,null,null,null,null,null,null,null,null,"X","In sede"]
[null,"Possibili Scenari Concomitanti",null,null,null,null,null,null,null,null,"Non ragionevolmente prevedibile la concomitanza con altri eventi."]
[]
[]
[]
[]
[null,"Contatti Utili",null,null,null,null,null,null,null,null,{"$f":"\"Consultare il \"&IF([1]Maschera!Z71=\"\",[1]Maschera!N71,[1]Maschera!Z71)","v":"Consultare il Tomo Giallo - Risorse"}]
[null,"Cartografia",null,null,null,null,null,null,null,null,{"$f":"INDEX(RSS6PAR,1,28)","v":0}]
[null,null,null,null,null,null,null,null,null,null,{"$f":"INDEX(RSS6PAR,1,39)","v":0}]
[null,null,null,null,null,null,null,null,null,null,{"$f":"INDEX(RSS6PAR,1,50)","v":0}]
[]
[{"$f":"Titolo2","v":"Procedure U.C.L."},null,null,null,null,null,null,null,null,null,null,null,null,null,null,null,null,null,null,null,null,null,null,{"$f":"X4","v":"RIL.4"}]
[]
[{"$f":"$A$6","v":" - Fase di Allerta Codice 4"}]
[]
[]
["RESPONSABILE",null,null,null,null,"AZIONE",null,null,null,null,null,"CHIAMATE"]
[null,null,null,null,null,null,null,null,null,null,null,"MEMBRO UCL",null,null,null,"OPERATIVI",null,null,null,"ENTE INTERESSATO",null,null,null,"SCHEDE CHIAMATE"]
[]
[{"$f":"IF(INDEX(Sindaco,1,9)=\"\",INDEX(Sindaco,1,1),INDEX(Sindaco,1,9))","v":"SINDACO / R.O.C."},null,null,null,null,{"$f":"\"Dichiara lo stato di emergenza / Allerta Codice 4 e attiva il Servizio di Allerta e Salvaguardia. \"&_RSS4&\" - \"&_RSS5","v":"Dichiara lo stato di emergenza / Allerta Codice 4 e attiva il Servizio di Allerta e Salvaguardia. RIL.2 - RIL.3"},null,null,null,null,null,"- Tutti",null,null,null,"--",null,null,null,{"$f":"\"- \"&IF(INDEX(PR,1,9)=\"\",INDEX(PR,1,1),INDEX(PR,1,9))","v":"- Prefettura"}]
["(Codice 4 non preceduto da Codice 2/Codice 3)",null,null,null,null,null,null,null,null,null,null,null,null,null,null,null,null,null,null,{"$f":"\"- \"&IF(INDEX(PRO,1,9)=\"\",INDEX(PRO,1,1),INDEX(PRO,1,9))","v":"- Provincia"},null,null,null,"O1 - O2"]
[null,null,null,null,null,null,null,null,null,null,null,null,null,null,null,null,null,null,null,{"$f":"\"- \"&IF(INDEX(REG,1,9)=\"\",INDEX(REG,1,1),INDEX(REG,1,9))","v":"- Regione"},null,null,null,"C2.1","C2.3","C2.4"]
[]
[{"$f":"IF(INDEX(Sindaco,1,9)=\"\",INDEX(Sindaco,1,1),INDEX(Sindaco,1,9))","v":"SINDACO / R.O.C."},null,null,null,null,{"$f":"\"Nel caso siano necessari, attiva gli interventi di emergenza per riparazione e manutenzione. \"&_RSS6&\".1\"","v":"Nel caso siano necessari, attiva gli interventi di emergenza per riparazione e manutenzione. RIL.4.1"},null,null,null,null,null,null,null,null,null,"--",null,null,null,"--",null,null,null,"O1 - O2",null,null,{"$f":"_RSS6&\".1\"","v":"RIL.4.1"}]
[null,null,null,null,null,null,null,null,null,null,null,{"$f":"\"- \"&PROPER(IF(INDEX(RT,1,9)=\"\",INDEX(RT,1,1),INDEX(RT,1,9)))","v":"- Resp. Territorio"}]
[null,null,null,null,null,null,null,null,null,null,null,{"$f":"\"- \"&PROPER(IF(INDEX(CV,1,9)=\"\",INDEX(CV,1,1),INDEX(CV,1,9)))","v":"- C. Volontariato"}]
[]
[{"$f":"IF(INDEX(RT,1,9)=\"\",INDEX(RT,1,1),INDEX(RT,1,9))","v":"RESP. TERRITORIO"},null,null,null,null,{"$f":"\"Responsabile \"&_RSS6&\".1\"","v":"Responsabile RIL.4.1"},null,null,null,null,null,null,null,null,null,{"$f":"\"- \"&IF(INDEX(TCO,1,9)=\"\",INDEX(TCO,1,1),INDEX(TCO,1,9))","v":"- Tecnici Comunali"},null,null,null,"--",null,null,null,"O1 - O2",null,"A2.1"]
[null,null,null,null,null,null,null,null,null,null,null,{"$f":"\"- \"&PROPER(IF(INDEX(CV,1,9)=\"\",INDEX(CV,1,1),INDEX(CV,1,9)))","v":"- C. Volontariato"},null,null,null,null,null,null,null,null,null,null,null,"A4 - A5 - B2 - B4 - C1"]
[null,null,null,null,null,null,null,null,null,null,null,{"$f":"\"- \"&PROPER(IF(INDEX(RSS,1,9)=\"\",INDEX(RSS,1,1),INDEX(RSS,1,9)))","v":"- Resp. Serv. Sociali"}]
[]
[{"$f":"IF(INDEX(CV,1,9)=\"\",INDEX(CV,1,1),INDEX(CV,1,9))","v":"C. VOLONTARIATO"},null,null,null,null,{"$f":"\"Coadiuva \"&_RSS6&\".1\"","v":"Coadiuva RIL.4.1"},null,null,null,null,null,"--",null,null,null,{"$f":"\"- \"&IF(INDEX(VO,1,9)=\"\",INDEX(VO,1,1),INDEX(VO,1,9))","v":"- Gruppi Volontari"},null,null,null,"--",null,null,null,"A3 - B3"]
["SE LE AZIONI DI VIGILANZA E CONTRASTO SONO SUFFICIENTI OCCORRE CONTINUARE IN TALI ATTIVITA' SINO ALL'ESAURIMENTO DELL'EVENTO. IN CASO CONTRARIO OCCORRE, SE NECESSARIO, ATTIVARE LE SEGUENTI PROCEDURE:"]
[]
[]
[{"$f":"IF(INDEX(Sindaco,1,9)=\"\",INDEX(Sindaco,1,1),INDEX(Sindaco,1,9))","v":"SINDACO / R.O.C."},null,null,null,null,{"$f":"\"Informa la popolazione e gli Enti sovraordinati e provvede alla interdizione di nuove aree. \"&_RSS5&\".1\"","v":"Informa la popolazione e gli Enti sovraordinati e provvede alla interdizione di nuove aree. RIL.3.1"},null,null,null,null,null,{"$f":"\"- \"&PROPER(IF(INDEX(PL,1,9)=\"\",INDEX(PL,1,1),INDEX(PL,1,9)))","v":"- Polizia Locale"},null,null,null,"--",null,null,null,{"$f":"\"- \"&IF(INDEX(PR,1,9)=\"\",INDEX(PR,1,1),INDEX(PR,1,9))","v":"- Prefettura"}]
[null,null,null,null,null,null,null,null,null,null,null,{"$f":"\"- \"&PROPER(IF(INDEX(CV,1,9)=\"\",INDEX(CV,1,1),INDEX(CV,1,9)))","v":"- C. Volontariato"},null,null,null,null,null,null,null,{"$f":"\"- \"&IF(INDEX(PRO,1,9)=\"\",INDEX(PRO,1,1),INDEX(PRO,1,9))","v":"- Provincia"},null,null,null,"O1 - O2"]
[null,null,null,null,null,null,null,null,null,null,null,{"$f":"\"- \"&PROPER(IF(INDEX(CC,1,9)=\"\",INDEX(CC,1,1),INDEX(CC,1,9)))","v":"- C. Carabinieri"},null,null,null,null,null,null,null,{"$f":"\"- \"&IF(INDEX(REG,1,9)=\"\",INDEX(REG,1,1),INDEX(REG,1,9))","v":"- Regione"},null,null,null,"C2.1","C2.3","C2.4"]
[]
[{"$f":"IF(INDEX(Sindaco,1,9)=\"\",INDEX(Sindaco,1,1),INDEX(Sindaco,1,9))","v":"SINDACO / R.O.C."},null,null,null,null,{"$f":"\"Ordina evacuazioni di Emergenza e attiva le procedure relative: \"","v":"Ordina evacuazioni di Emergenza e attiva le procedure relative: "},null,null,null,null,null,"- Tutti",null,null,null,"--",null,null,null,"--",null,null,null,"O1 - O2"]
[]
[]
[null,null,null,null,null,{"$f":"_RSS5&\".2 - \"&_RSS5&\".3\"","v":"RIL.3.2 - RIL.3.3"}]
[{"$f":"IF(INDEX(Sindaco,1,9)=\"\",INDEX(Sindaco,1,1),INDEX(Sindaco,1,9))","v":"SINDACO / R.O.C."},null,null,null,null,{"$f":"\"Attiva la procedura \"&_RSS6&\".1 \"&\"in altre aree del territorio eventualmente coinvolte\"","v":"Attiva la procedura RIL.4.1 in altre aree del territorio eventualmente coinvolte"},null,null,null,null,null,{"$f":"\"- \"&PROPER(IF(INDEX(RT,1,9)=\"\",INDEX(RT,1,1),INDEX(RT,1,9)))","v":"- Resp. Territorio"},null,null,null,"--",null,null,null,"--",null,null,null,"O1 - O2",null,null,{"$f":"_RSS6&\".1\"","v":"RIL.4.1"}]
[]
[null,null,null,null,null,null,null,null,null,null,null,{"$f":"\"- \"&PROPER(IF(INDEX(CV,1,9)=\"\",INDEX(CV,1,1),INDEX(CV,1,9)))","v":"- C. Volontariato"}]
["SE L'EVENTO E' GESTIBILE DAL COMUNE"]
[{"$f":"IF(INDEX(Sindaco,1,9)=\"\",INDEX(Sindaco,1,1),INDEX(Sindaco,1,9))","v":"SINDACO / R.O.C."},null,null,null,null,"Informa periodicamente gli enti sovraordinati e i media su quanto fatto.",null,null,null,null,null,"- Tutti",null,null,null,"--",null,null,null,{"$f":"\"- \"&IF(INDEX(PR,1,9)=\"\",INDEX(PR,1,1),INDEX(PR,1,9))","v":"- Prefettura"}]
[null,null,null,null,null,null,null,null,null,null,null,null,null,null,null,null,null,null,null,{"$f":"\"- \"&IF(INDEX(PRO,1,9)=\"\",INDEX(PRO,1,1),INDEX(PRO,1,9))","v":"- Provincia"},null,null,null,"O1 - O2"]
[null,null,null,null,null,null,null,null,null,null,null,null,null,null,null,null,null,null,null,{"$f":"\"- \"&IF(INDEX(REG,1,9)=\"\",INDEX(REG,1,1),INDEX(REG,1,9))","v":"- Regione"},null,null,null,"C2.1","C2.3","C2.4"]
[]
[{"$f":"IF(INDEX(Sindaco,1,9)=\"\",INDEX(Sindaco,1,1),INDEX(Sindaco,1,9))","v":"SINDACO / R.O.C."},null,null,null,null,"Informa sulla revoca dello stato di emergenza.",null,null,null,null,null,"- Tutti",null,null,null,{"$f":"\"- \"&IF(INDEX(SC,1,9)=\"\",INDEX(SC,1,1),INDEX(SC,1,9))","v":"- Squadre Operativi"},null,null,null,{"$f":"\"- \"&IF(INDEX(PR,1,9)=\"\",INDEX(PR,1,1),INDEX(PR,1,9))","v":"- Prefettura"},null,null,null,"O1 - O2"]
[null,null,null,null,null,null,null,null,null,null,null,null,null,null,null,null,null,null,null,{"$f":"\"- \"&IF(INDEX(PRO,1,9)=\"\",INDEX(PRO,1,1),INDEX(PRO,1,9))","v":"- Provincia"},null,null,null,"C2.1","C2.3","C2.4"]
["MEMBRI U.C.L",null,null,null,null,null,null,null,null,null,null,null,null,null,null,null,null,null,null,{"$f":"\"- \"&IF(INDEX(REG,1,9)=\"\",INDEX(REG,1,1),INDEX(REG,1,9))","v":"- Regione"},null,null,null,"M1","M2"]
[]
["SE L'EVENTO NON E' GESTIBILE DAL COMUNE"]
[{"$f":"IF(INDEX(Sindaco,1,9)=\"\",INDEX(Sindaco,1,1),INDEX(Sindaco,1,9))","v":"SINDACO / R.O.C."},null,null,null,null,"Informa i media e gli enti sovraordinati. ",null,null,null,null,null,"--",null,null,null,"--",null,null,null,{"$f":"\"- \"&IF(INDEX(PR,1,9)=\"\",INDEX(PR,1,1),INDEX(PR,1,9))","v":"- Prefettura"}]
[null,null,null,null,null,null,null,null,null,null,null,null,null,null,null,null,null,null,null,{"$f":"\"- \"&IF(INDEX(PRO,1,9)=\"\",INDEX(PRO,1,1),INDEX(PRO,1,9))","v":"- Provincia"},null,null,null,"C2.1","C2.3","C2.4"]
[null,null,null,null,null,null,null,null,null,null,null,null,null,null,null,null,null,null,null,{"$f":"\"- \"&IF(INDEX(REG,1,9)=\"\",INDEX(REG,1,1),INDEX(REG,1,9))","v":"- Regione"}]
[]
[{"$f":"IF(INDEX(Sindaco,1,9)=\"\",INDEX(Sindaco,1,1),INDEX(Sindaco,1,9))","v":"SINDACO / R.O.C."},null,null,null,null,{"$f":"\"Si coordina con il \"&COM&\" e attiva le aree di ammassamento soccorsi. \"&_RSS6&\".2\"","v":"Si coordina con il COM Monza e attiva le aree di ammassamento soccorsi. RIL.4.2"},null,null,null,null,null,null,null,null,null,"--",null,null,null,{"$f":"\"- \"&COM","v":"- COM Monza"},null,null,null,null,null,null,{"$f":"_RSS6&\".2\"","v":"RIL.4.2"}]
[null,null,null,null,null,null,null,null,null,null,null,{"$f":"\"- \"&PROPER(IF(INDEX(RT,1,9)=\"\",INDEX(RT,1,1),INDEX(RT,1,9)))","v":"- Resp. Territorio"},null,null,null,null,null,null,null,null,null,null,null,"O1 - O2",null,"C2.1"]
[null,null,null,null,null,null,null,null,null,null,null,{"$f":"\"- \"&PROPER(IF(INDEX(CV,1,9)=\"\",INDEX(CV,1,1),INDEX(CV,1,9)))","v":"- C. Volontariato"}]
[]
[{"$f":"IF(INDEX(RT,1,9)=\"\",INDEX(RT,1,1),INDEX(RT,1,9))","v":"RESP. TERRITORIO"},null,null,null,null,{"$f":"\"Responsabile \"&_RSS6&\".2\"","v":"Responsabile RIL.4.2"},null,null,null,null,null,null,null,null,null,{"$f":"\"- \"&IF(INDEX(TCO,1,9)=\"\",INDEX(TCO,1,1),INDEX(TCO,1,9))","v":"- Tecnici Comunali"},null,null,null,"--",null,null,null,"O1 - O2",null,"A2.1"]
[null,null,null,null,null,null,null,null,null,null,null,{"$f":"\"- \"&PROPER(IF(INDEX(CV,1,9)=\"\",INDEX(CV,1,1),INDEX(CV,1,9)))","v":"- C. Volontariato"},null,null,null,null,null,null,null,null,null,null,null,"A4 A5 A6 A8 B5 B6 C1"]
[]
[{"$f":"IF(INDEX(CV,1,9)=\"\",INDEX(CV,1,1),INDEX(CV,1,9))","v":"C. VOLONTARIATO"},null,null,null,null,{"$f":"\"Coadiuva \"&_RSS6&\".2\"","v":"Coadiuva RIL.4.2"},null,null,null,null,null,"--",null,null,null,{"$f":"\"- \"&IF(INDEX(VO,1,9)=\"\",INDEX(VO,1,1),INDEX(VO,1,9))","v":"- Gruppi Volontari"},null,null,null,"--",null,null,null,"A3 - B3"]
[]
["PER LE COMUNICAZIONI EVIDENZIATE IN ROSSO UTILIZZARE IL MODULO FAX M4"]
[]
[{"$f":"Titolo3","v":"Scheda Procedura Operativa"},null,null,null,null,null,null,null,null,null,null,null,null,null,null,null,null,null,null,null,null,null,null,{"$f":"$X$4&\".1\"","v":"RIL.4.1"}]
[]
[{"$f":"$A$6","v":" - Fase di Allerta Codice 4"}]
[]
[]
[null,"Codice Scheda Scenario",null,null,null,null,null,null,null,null,{"$f":"X4","v":"RIL.4"}]
[null,"SERVIZIO DI SOCCORSO ",null,null,null,null,null,null,null,null,null,null,null,"- PRESERVAZIONE ARGINI"]
[null,"Descrizione attività",null,null,null,null,null,null,null,null,"Preparare e posizionare sacchetti di sabbia per arginature."]
[null,"Personale Coinvolto",null,null,null,null,null,null,null,null,"Polizia Locale"]
[null,null,null,null,null,null,null,null,null,null,"Volontari P.C."]
[null,null,null,null,null,null,null,null,null,null,"Tecnici/Operai Comunali"]
[null,"Numero Operatori Consigliato",null,null,null,null,null,null,null,null,"Una squadra per ogni sezione di argine a rischio."]
[null,"Automezzo dedicato",null,null,null,null,null,null,null,null,"Uno per  squadra."]
[null,"Azioni",null,null,null,null,null,null,null,null,"Predisposizione in area sicura dei sacchi di sabbia da impiegare:"]
[null,null,null,null,null,null,null,null,null,null,"- nell' innalzamento degli argini;"]
[null,null,null,null,null,null,null,null,null,null,"- nell'interventi di confinamento dei fenomeni di sifonamento degli argini (fontanazzi);"]
[]
[null,null,null,null,null,null,null,null,null,null,"- nell'allestimento di barriere di protezione per gli accessi agli immobili più esposti."]
[]
[null,null,null,null,null,null,null,null,null,null,"Nelle aree arginate e sicure posizionare idrovore per l'allontanamento dell'acqua."]
[]
[null,null,null,null,null,null,null,null,null,null,"Fare rapporti all'UCL ad intervalli regolari descrivendo lo stato degli argini e l'avanzamento dei lavori."]
[]
[null,"Ubicazione Intervento",null,null,null,null,null,null,null,null,"Zone colpite in accordo con l'UCL."]
[null,"Equipaggiamento minimo consigliato ",null,null,null,null,null,null,null,null,"Vestiario alta visibilità EN471 - Impermeabile."]
[null,"Materiale Necessario",null,null,null,null,null,null,null,null,"Sabbia - sacchi in nylon o canapa - cordame - badili  - bancali - teli di cellophane o nylon  - idrovore (almeno 1.000 lt/min) con aspirazione e tubi di mandata."]
[]
[]
[null,"Modalità di comunicazione",null,null,null,null,null,null,null,null,"Cellulare / Radio"]
[null,"Procedure Operativa Standard (POS)",null,null,null,null,null,null,null,null,"Evacuazione Popolazione"]
[null,"Termine intervento",null,null,null,null,null,null,null,null,"Concordato con UCL - Alla fine della fase di emergenza."]
[null,"Contatti Utili",null,null,null,null,null,null,null,null,"Si faccia riferimento al PRONTUARIO DI EMERGENZA - CONTATTI"]
[]
[]
[]
[]
[]
[]
[]
[]
[]
[]
[]
[]
[]
[]
[]
[]
[]
[]
[]
[]
[]
[]
[]
[]
[]
[]
["Scheda Procedura",null,null,null,null,null,null,null,null,null,null,null,null,null,null,null,null,null,null,null,null,null,null,{"$f":"$X$4&\".2\"","v":"RIL.4.2"}]
[]
[{"$f":"$A$6","v":" - Fase di Allerta Codice 4"}]
[]
[]
[null,"Codice Scheda Scenario",null,null,null,null,null,null,null,null,{"$f":"$X$4","v":"RIL.4"}]
[null,"SERVIZIO DI SOCCORSO - ALLESTIMENTO AREA DI AMMASSAMENTO SOCCORSI"]
[null,"Descrizione attività",null,null,null,null,null,null,null,null,"Predisporre i materiali e le attrezzature necessarie all'accoglienza dei soccorritori."]
[]
[null,"Personale Coinvolto",null,null,null,null,null,null,null,null,"Polizia Locale"]
[null,null,null,null,null,null,null,null,null,null,"Volontari P.C."]
[null,null,null,null,null,null,null,null,null,null,"Tecnici/Operai Comunali"]
[null,"Numero Operatori Consigliato",null,null,null,null,null,null,null,null,"Minimo 2 squadre"]
[null,"Automezzo dedicato",null,null,null,null,null,null,null,null,"Si"]
[null,"Azioni",null,null,null,null,null,null,null,null,"Rendere accessibili le aree preventivamente individuate."]
[null,null,null,null,null,null,null,null,null,null,"Piantonare l'ingresso, accogliere registrare e dislocare mezzi e personale."]
[null,null,null,null,null,null,null,null,null,null,"Fare periodico rapporto all'UCL."]
[null,"Ubicazione Area di raduno soccorritori",null,null,null,null,null,null,null,null,{"$f":"IF(INDEX(RSS6SOC,1,1)=\"\",\"In questa fase non è prevista l’attivazione di tali aree.\",\"Per questa emergenza \"&IF(INDEX(RSS6SOC,1,2)=\"\",\"è disponibile la seguente area:\",\"sono disponibili le seguenti aree:\"))","v":"In questa fase non è prevista l’attivazione di tali aree."}]
[null,null,null,null,null,null,null,null,null,null,{"$f":"IF(INDEX(RSS6SOC,1,1)=\"\",\"\",\"- \"&VLOOKUP(INDEX(RSS6SOC,1,1),Soccorritori,2))","v":""}]
[null,null,null,null,null,null,null,null,null,null,{"$f":"IF(INDEX(RSS6SOC,1,2)=\"\",\"\",\"- \"&VLOOKUP(INDEX(RSS6SOC,1,2),Soccorritori,2))","v":""}]
[null,null,null,null,null,null,null,null,null,null,{"$f":"IF(INDEX(RSS6SOC,1,3)=\"\",\"\",\"- \"&VLOOKUP(INDEX(RSS6SOC,1,3),Soccorritori,2))","v":""}]
[null,null,null,null,null,null,null,null,null,null,{"$f":"IF(K201=\"\",\"\",\"In funzione della gravità della situazione si decide quali/quante aree attivare.\")","v":""}]
[null,"Equipaggiamento minimo consigliato ",null,null,null,null,null,null,null,null,"Brande/Cuscini/Materassi/Coperte"]
[null,"Materiale Necessario",null,null,null,null,null,null,null,null,"Generi di prima necessità (Acqua, Carta igienica, viveri, ecc.)"]
[null,"Modalità di comunicazione",null,null,null,null,null,null,null,null,"Cellulare / Radio"]
[null,"Procedure Operativa Standard (POS)",null,null,null,null,null,null,null,null,"Evacuazione Popolazione"]
[null,"Termine intervento",null,null,null,null,null,null,null,null,"Concordato con UCL - Alla fine della fase di emergenza."]
[null,"Contatti Utili",null,null,null,null,null,null,null,null,"Si faccia riferimento all’ELENCO DEI CONTATTI UTILI PER GLI OPERATIVI"]

{"sheet":"GE","index":19,"n_rows":178,"n_cols":26,"rows_kept":178,"cut":false,"hidden":false,"merged":[[0,0,1,6],[0,7,1,18],[0,19,1,25],[3,0,4,22],[3,23,6,25],[5,0,6,22],[15,1,16,9],[15,10,16,24],[17,1,17,9],[17,10,17,24],[18,1,20,9],[8,1,8,9],[8,10,8,24],[9,1,9,9],[9,10,9,24],[10,1,14,9],[10,10,14,24],[18,17,20,24],[18,10,18,16],[19,10,19,16],[20,10,20,16],[35,1,37,9],[35,10,35,24],[36,10,36,24],[37,10,37,24],[38,1,40,9],[38,10,38,24],[39,10,39,24],[40,10,40,24],[21,1,23,9],[21,10,23,24],[24,1,28,9],[24,10,28,24],[29,1,34,9],[29,10,34,24],[48,1,50,9],[48,11,48,24],[49,11,49,24],[50,11,50,24],[41,1,44,9],[41,10,41,24],[42,10,42,24],[43,10,43,24],[44,10,44,24],[45,1,47,9],[45,10,47,24],[68,0,70,4],[68,5,70,10],[68,11,68,25],[69,11,70,14],[69,15,70,18],[69,19,70,22],[69,23,70,25],[56,10,56,24],[57,10,57,24],[63,0,64,22],[63,23,66,25],[65,0,66,22],[139,10,139,24],[140,10,140,24],[133,10,133,24],[123,0,124,22],[123,23,126,25],[125,0,126,22],[80,0,82,4],[80,5,82,10],[80,11,82,14],[80,15,82,18],[80,19,82,22],[81,23,81,24],[128,1,128,9],[128,10,128,24],[129,1,129,9],[129,10,129,24],[51,1,54,9],[51,10,54,24],[55,1,55,9],[55,10,55,24],[56,1,57,9],[71,0,74,4],[175,3,175,15],[175,16,175,23],[170,3,170,15],[170,16,170,23],[171,3,171,15],[171,16,171,23],[168,3,168,15],[168,16,168,23],[169,3,169,15],[169,16,169,23],[130,1,143,9],[130,10,132,24],[141,10,143,24],[134,10,134,24],[135,10,135,24],[136,10,136,24],[137,10,137,24],[138,10,138,24],[71,23,74,25],[75,0,79,4],[75,5,79,10],[75,11,79,14],[75,15,79,18],[75,19,79,22],[75,23,79,25],[71,5,74,10],[71,11,74,14],[71,15,74,18],[71,19,74,22],[160,1,162,9],[160,10,162,24],[165,2,166,15],[165,16,166,23],[167,3,167,15],[167,16,167,23],[144,1,159,9],[144,10,144,24],[145,10,146,24],[147,10,149,24],[150,10,153,24],[154,10,156,24],[157,10,159,24],[176,3,176,15],[176,16,176,23],[177,3,177,15],[177,16,177,23],[172,3,172,15],[172,16,172,23],[173,3,173,15],[173,16,173,23],[174,3,174,15],[174,16,174,23]]}
[{"$f":"NCOM&\" (\"&PCOM&\")\"","v":"Comune di Trescore Cremasco (CR)"},null,null,null,null,null,null,{"$f":"IF(INDEX(INT,1,13)=\"\",INDEX(INT,1,1),INDEX(INT,1,13))","v":"Piano di Emergenza Intercomunale di Protezione Civile"},null,null,null,null,null,null,null,null,null,null,null,{"$f":"IF(TIPOP=\"Edizione\",\"Ed. \",IF(TIPOP=\"Revisione\",\"Rev. \",\"Bozza \"))&TIPON&\" del \"&TIPOD","v":"Ed. 01 del 04/11/2012"}]
[]
[]
["Scheda Scenario",null,null,null,null,null,null,null,null,null,null,null,null,null,null,null,null,null,null,null,null,null,null,{"$f":"_RSS1","v":"GE"}]
[]
[{"$f":"IF(INDEX(RSS1PAR,1,19)=\"\",INDEX(RSS1PAR,1,12),INDEX(RSS1PAR,1,19))","v":"Grande Evento nel Parco di Monza"}]
[]
[]
[null,"Paragrafi di Riferimento ",null,null,null,null,null,null,null,null,{"$f":"INDEX(RSS1PAR,1,1)&INDEX(RSS1PAR,1,12)","v":"2.2.8.3 Procedure per il Grande Evento nel Parco di Monza"}]
[null,"Codice Scheda",null,null,null,null,null,null,null,null,{"$f":"X4","v":"GE"}]
[null,"Evento atteso",null,null,null,null,null,null,null,null,"Grande evento organizzato nel Parco di Monza che richiami grandi masse di pubblico all’interno del territorio comunale. "]
[]
[]
[]
[]
[null,"Attività U.C.L.",null,null,null,null,null,null,null,null,"Supporta il Comandante della Polizia Locale nella gestione del traffico veicolare."]
[]
[null,"Ubicazione intervento",null,null,null,null,null,null,null,null,"Coinvolge le aree limitrofe agli ingressi al parco segnate in cartografia."]
[null,"Personale mobilitato",null,null,null,null,null,null,null,null,{"$f":"IF(INDEX(RSS1PER,1,1)=\"\",\"\",\"- \"&VLOOKUP(INDEX(RSS1PER,1,1),Personale,IF(INDEX(Personale,INDEX(RSS1PER,1,1),14)=\"\",2,14)))","v":"- Polizia Locale"},null,null,null,null,null,null,"Riportare la composizione delle squadre nel Modulo M1"]
[null,null,null,null,null,null,null,null,null,null,{"$f":"IF(INDEX(RSS1PER,1,2)=\"\",\"\",\"- \"&VLOOKUP(INDEX(RSS1PER,1,2),Personale,IF(INDEX(Personale,INDEX(RSS1PER,1,2),14)=\"\",2,14)))","v":"- Volontari P.C."}]
[null,null,null,null,null,null,null,null,null,null,{"$f":"IF(INDEX(RSS1PER,1,3)=\"\",\"\",\"- \"&VLOOKUP(INDEX(RSS1PER,1,3),Personale,IF(INDEX(Personale,INDEX(RSS1PER,1,3),14)=\"\",2,14)))","v":"- Tecnici/Operai Comunali"}]
[null,"Attività personale mobilitato",null,null,null,null,null,null,null,null,"Monitoraggio delle zone interessate mediante presidio costante o perlustrazione. "]
[]
[]
[null,"Grado di coinvolgimento della popolazione",null,null,null,null,null,null,null,null,"La popolazione risente di possibili disagi dovuti alla variazione della circolazione ed alla chiusura di alcune strade."]
[]
[]
[]
[]
[null,"Cancelli e vie alternative",null,null,null,null,null,null,null,null,"Vengono posizionati dei cancelli finalizzati alla regolazione del traffico e allo smaltimento dello stesso."]
[]
[]
[]
[]
[]
[null,"Aree di raccolta popolazione",null,null,null,null,null,null,null,null,{"$f":"IF(INDEX(RSS1RIC,1,1)=\"\",\"In questa fase non è prevista l’attivazione di tali aree.\",\"Per questa emergenza \"&IF(INDEX(RSS1RIC,1,2)=\"\",\"è disponibile la seguente area:\",\"sono disponibili le seguenti aree:\"))","v":"In questa fase non è prevista l’attivazione di tali aree."}]
[null,null,null,null,null,null,null,null,null,null,{"$f":"IF(INDEX(RSS1RIC,1,1)=\"\",\"\",\"- \"&VLOOKUP(INDEX(RSS1RIC,1,1),Ricovero,2))","v":""}]
[null,null,null,null,null,null,null,null,null,null,{"$f":"IF(INDEX(RSS1RIC,1,2)=\"\",\"\",\"- \"&VLOOKUP(INDEX(RSS1RIC,1,2),Ricovero,2))","v":""}]
[null,"Area di ricovero",null,null,null,null,null,null,null,null,{"$f":"IF(INDEX(RSS1RIC,1,3)=\"\",\"\",\"- \"&VLOOKUP(INDEX(RSS1RIC,1,3),Ricovero,2))","v":""}]
[null,null,null,null,null,null,null,null,null,null,{"$f":"IF(INDEX(RSS1RIC,1,4)=\"\",\"\",\"- \"&VLOOKUP(INDEX(RSS1RIC,1,4),Ricovero,2))","v":""}]
[null,null,null,null,null,null,null,null,null,null,{"$f":"IF(K38=\"\",\"\",\"In funzione della gravità della situazione si decide quali/quante aree attivare.\")","v":""}]
[null,"Area di raduno soccorritori",null,null,null,null,null,null,null,null,{"$f":"IF(INDEX(RSS1SOC,1,1)=\"\",\"In questa fase non è prevista l’attivazione di tali aree.\",\"Per questa emergenza \"&IF(INDEX(RSS1SOC,1,2)=\"\",\"è disponibile la seguente area:\",\"sono disponibili le seguenti aree:\"))","v":"In questa fase non è prevista l’attivazione di tali aree."}]
[null,null,null,null,null,null,null,null,null,null,{"$f":"IF(INDEX(RSS1SOC,1,1)=\"\",\"\",\"- \"&VLOOKUP(INDEX(RSS1SOC,1,1),Ricovero,2))","v":""}]
[null,null,null,null,null,null,null,null,null,null,{"$f":"IF(INDEX(RSS1SOC,1,2)=\"\",\"\",\"- \"&VLOOKUP(INDEX(RSS1SOC,1,2),Ricovero,2))","v":""}]
[null,null,null,null,null,null,null,null,null,null,{"$f":"IF(K43=\"\",\"\",\"In funzione della gravità della situazione si decide quali/quante aree attivare.\")","v":""}]
[null,"Ordinanze Necessarie",null,null,null,null,null,null,null,null,"Non determinabili a priori."]
[]
[]
[null,"Modalita’ Riunione U.C.L.",null,null,null,null,null,null,null,null,"X","Non necessaria"]
[null,null,null,null,null,null,null,null,null,null,null,"Virtuale"]
[null,null,null,null,null,null,null,null,null,null,null,"In sede"]
[null,"Possibili Scenari Concomitanti",null,null,null,null,null,null,null,null,"E’ possibile che si verifichino altri scenari di rischio in concomitanza di un grande evento. Consultare la Scheda Scenario relativa tenendo conto di quanto previsto per questo scenario."]
[]
[]
[]
[null,"Contatti Utili",null,null,null,null,null,null,null,null,{"$f":"\"Consultare il \"&IF([1]Maschera!Z71=\"\",[1]Maschera!N71,[1]Maschera!Z71)","v":"Consultare il Tomo Giallo - Risorse"}]
[null,"Cartografia",null,null,null,null,null,null,null,null,{"$f":"INDEX(RSS1PAR,1,28)","v":"Tav. 3/C - Rischio Viabilità - AIB - Altri Rischi"}]
[null,null,null,null,null,null,null,null,null,null,{"$f":"INDEX(RSS1PAR,1,39)","v":"Tav. 3/D - Stradario Piano di Emergenza"}]
[]
[]
[]
[]
[]
[{"$f":"Titolo2","v":"Procedure U.C.L."},null,null,null,null,null,null,null,null,null,null,null,null,null,null,null,null,null,null,null,null,null,null,{"$f":"X4","v":"GE"}]
[]
[{"$f":"$A$6","v":"Grande Evento nel Parco di Monza"}]
[]
[]
["RESPONSABILE",null,null,null,null,"AZIONE",null,null,null,null,null,"CHIAMATE"]
[null,null,null,null,null,null,null,null,null,null,null,"MEMBRO UCL",null,null,null,"OPERATRSS1I",null,null,null,"ENTE INTERESSATO",null,null,null,"SCHEDE CHIAMATE"]
[]
[{"$f":"IF(INDEX(PL,1,9)=\"\",INDEX(PL,1,1),INDEX(PL,1,9))","v":"POLIZIA LOCALE"},null,null,null,null,{"$f":"\"Organizza la chiusura di strade comunali prima dell’evento e il presidio del territorio. \"","v":"Organizza la chiusura di strade comunali prima dell’evento e il presidio del territorio. "},null,null,null,null,null,{"$f":"\"- \" & PROPER(IF(INDEX(CV,1,9)=\"\",INDEX(CV,1,1),INDEX(CV,1,9)))","v":"- C. Volontariato"},null,null,null,{"$f":"\"- \" & IF(INDEX(PLO,1,9)=\"\",INDEX(PLO,1,1),INDEX(PLO,1,9))","v":"- Agenti P.L."},null,null,null,"--",null,null,null,"O1 - O2  A2.2"]
[]
[]
[]
[{"$f":"IF(INDEX(PL,1,9)=\"\",INDEX(PL,1,1),INDEX(PL,1,9))","v":"POLIZIA LOCALE"},null,null,null,null,"Organizza i cancelli per la gestione del traffico sia veicolare che pedonale in uscita dall’autodromo e il presidio del territorio.",null,null,null,null,null,{"$f":"\"- \" & PROPER(IF(INDEX(CV,1,9)=\"\",INDEX(CV,1,1),INDEX(CV,1,9)))","v":"- C. Volontariato"},null,null,null,{"$f":"\"- \" & IF(INDEX(PLO,1,9)=\"\",INDEX(PLO,1,1),INDEX(PLO,1,9))","v":"- Agenti P.L."},null,null,null,"--",null,null,null,"O1 - O2  A2.2"]
[]
[]
[]
[]
[{"$f":"IF(INDEX(PL,1,9)=\"\",INDEX(PL,1,1),INDEX(PL,1,9))","v":"POLIZIA LOCALE"},null,null,null,null,"A deflusso terminato dispone il rientro delle squadre.",null,null,null,null,null,{"$f":"\"- \" & PROPER(IF(INDEX(CV,1,9)=\"\",INDEX(CV,1,1),INDEX(CV,1,9)))","v":"- C. Volontariato"},null,null,null,{"$f":"\"- \" & IF(INDEX(SC,1,9)=\"\",INDEX(SC,1,1),INDEX(SC,1,9))","v":"- Squadre Operativi"},null,null,null,"--"]
[null,null,null,null,null,null,null,null,null,null,null,null,null,null,null,null,null,null,null,null,null,null,null,"O1 - O2  ",null,"M1"]
[]
[]
[]
[]
[]
[]
[]
[]
[]
[]
[]
[]
[]
[]
[]
[]
[]
[]
[]
[]
[]
[]
[]
[]
[]
[]
[]
[]
[]
[]
[]
[]
[]
[]
[]
[]
[]
[]
[]
[]
[]
[{"$f":"Titolo3","v":"Scheda Procedura Operativa"},null,null,null,null,null,null,null,null,null,null,null,null,null,null,null,null,null,null,null,null,null,null,{"$f":"X4","v":"GE"}]
[]
[{"$f":"$A$6","v":"Grande Evento nel Parco di Monza"}]
[]
[]
[null,"Codice Scheda Scenario",null,null,null,null,null,null,null,null,{"$f":"X124","v":"GE"}]
[null,"Ubicazione intervento",null,null,null,null,null,null,null,null,"Area interessata dall'afflusso/deflusso del pubblico."]
[null,"Viabilità Chiusa al Traffico",null,null,null,null,null,null,null,null,"L’afflusso al Parco di Monza è gestito chiudendo al traffico tra le 22.00 del giorno precedente all’evento fino a poco prima della fine dello stesso le seguenti vie:"]
[]
[]
[null,null,null,null,null,null,null,null,null,null,"- Via Santa Maria alle Selve "]
[null,null,null,null,null,null,null,null,null,null,"- Via S. Ambrogio "]
[null,null,null,null,null,null,null,null,null,null,"- Via S. Andrea "]
[null,null,null,null,null,null,null,null,null,null,"- Via Colombo "]
[null,null,null,null,null,null,null,null,null,null,"- Via Tintori "]
[null,null,null,null,null,null,null,null,null,null,"- Via Parco "]
[null,null,null,null,null,null,null,null,null,null,"- Via Regina Margherita "]
[null,null,null,null,null,null,null,null,null,null,"- Via Costa Alta"]
[null,null,null,null,null,null,null,null,null,null,"Il divieto è fatto salvo i residenti e gli ingressi accreditati verso i parcheggi pubblici di proprietà comunale eventualmente ceduti all’organizzazione dell’evento"]
[]
[]
[null,"Gestione del Traffico",null,null,null,null,null,null,null,null,"Il traffico viene gestito secondo le seguenti direttiva di basee:"]
[null,null,null,null,null,null,null,null,null,null,"-  Via Misericordia diventa a senso unico dalla Provinciale n. 6 a Lissone, poi il flusso viene incanalato sulla Strada Statale n. 36. "]
[]
[null,null,null,null,null,null,null,null,null,null,"- Tutto il traffico proveniente dall’uscita di Vedano al Lambro in direzione di Biassono e il flusso che arriva da Biassono, dall’uscita di Santa Maria alle Selve, vengono fatti confluire su Via Misericordia. "]
[]
[]
[null,null,null,null,null,null,null,null,null,null,"-  La Provinciale n. 6, per il traffico proveniente da Nord (Carate Brianza, Sovico, Macherio) viene deviato all'interno di Biassono all'altezza di Via Alberto da Giussano, Via Mazzini, Via Trento e Trieste, in direzione Lissone, per poi essere incanalato lungo la Statale n. 36; "]
[]
[]
[]
[null,null,null,null,null,null,null,null,null,null,"-  Tutto il traffico di Via Parco (Uscita Biassono) va verso Lesmo, Arcore, Vimercate, Tangenziale Est, attraverso il passaggio a livello o si dirige verso Nord in via Madonna delle Nevi."]
[]
[]
[null,null,null,null,null,null,null,null,null,null,"-  Il traffico incanalato in via Madonna delle Nevi prosegue in via Volta fino ad arrivare a prendere la Provinciale n. 6 in direzione nord, verso Carate Brianza, per poi andare a prendere la Statale n. 36."]
[]
[]
[null,"Contatti Utili",null,null,null,null,null,null,null,null,"Si faccia riferimento al PRONTUARIO DI EMERGENZA - CONTATTI"]
[]
[]
[]
[]
[null,null,"Procedura Operativa Standard (POS)",null,null,null,null,null,null,null,null,null,null,null,null,null,"Procedure Previste"]
[]
[null,null,1,"Monitoraggio",null,null,null,null,null,null,null,null,null,null,null,null,"--"]
[null,null,2,"Perlustrazione",null,null,null,null,null,null,null,null,null,null,null,null,"--"]
[null,null,3,"Presidio Cancelli/Supporto Viabilità",null,null,null,null,null,null,null,null,null,null,null,null,"X"]
[null,null,4,"Informazione Diretta alla Popolazione",null,null,null,null,null,null,null,null,null,null,null,null,"X"]
[null,null,5,"Allestimento Area di Ricovero",null,null,null,null,null,null,null,null,null,null,null,null,"--"]
[null,null,6,"Allestimento Area di Ammassamento Soccorsi",null,null,null,null,null,null,null,null,null,null,null,null,"--"]
[null,null,7,"Evacuazione",null,null,null,null,null,null,null,null,null,null,null,null,"--"]
[null,null,8,"Rimozione Ostacoli",null,null,null,null,null,null,null,null,null,null,null,null,"--"]
[null,null,9,"Rimozione Ostacoli da Alveo",null,null,null,null,null,null,null,null,null,null,null,null,"--"]
[null,null,10,"Preservazione Argini",null,null,null,null,null,null,null,null,null,null,null,null,"--"]
[null,null,11,"Frana",null,null,null,null,null,null,null,null,null,null,null,null,"--"]